program: Orca
programVersion: 5.0.2
elementType: O O O O O O O O O N N C C C C C C C C C C C C C C C C C C C C C C H H H H H H H H H H H H H H H H H H H H H H H H
charge: 0
multiplicity: 1
keywords: wb97x-d3
keywords: def2-TZVPP
keywords: def2/J RIJCOSX
keywords: DEFGRID2
keywords: scfconv7
keywords: smallprint printgap noloewdin
keywords: NOSOSCF
formula: C22H24N2O9
InChI: InChI=1/C22H24N2O9/c1-21(32)7-5-4-6-8(25)9(7)15(26)10-12(21)17(28)13-14(24(2)3)16(27)11(20(23)31)19(30)22(13,33)18(10)29/h4-6,12-14,17,25-26,28,30,32-33H,23H2,1-3H3
57 atoms
O  -0.167638 2.993622 1.474991
O  1.294019 2.557413 -0.88529
O  -1.954031 -0.842797 1.609731
O  0.853531 -0.268635 -2.321182
O  3.419512 1.321933 -1.886945
O  -1.429415 -1.101769 -2.602465
O  3.454716 -1.610955 1.764489
O  -3.926778 -1.406774 -3.267201
O  5.38297 0.009426 -1.556323
N  0.928501 -0.756853 2.634723
N  5.574609 -1.492451 0.094951
C  1.202867 1.052346 0.944455
C  -1.327333 1.148496 0.353939
C  -0.184333 1.594018 1.309425
C  1.476508 1.209036 -0.544229
C  1.428157 -0.429182 1.317827
C  -2.440956 0.389996 1.111719
C  -0.867683 0.344579 -0.835856
C  0.467763 0.358769 -1.316358
C  2.880291 0.748159 -0.868517
C  -3.541979 -0.009111 0.129999
C  2.887032 -0.804489 1.04205
C  -1.781183 -0.414386 -1.533612
C  3.529903 -0.212092 -0.118547
C  -2.994821 1.253087 2.244487
C  -3.1776 -0.476195 -1.151021
C  -4.872337 -0.013863 0.497703
C  0.744302 -2.172801 2.906046
C  1.546001 -0.062457 3.747658
C  -4.169858 -0.949316 -2.035365
C  4.888575 -0.569251 -0.555964
C  -5.846218 -0.466718 -0.389893
C  -5.506759 -0.932852 -1.638765
H  1.934124 1.662947 1.485986
H  -1.790284 2.070371 -0.020048
H  -0.384027 1.216627 2.310612
H  0.852453 -1.060018 0.626086
H  -2.214156 1.549176 2.943831
H  -3.732881 0.708461 2.831779
H  -3.460799 2.163676 1.867944
H  0.071929 3.394548 0.631507
H  1.369856 2.681613 -1.840354
H  -1.166819 -0.680926 2.157985
H  -5.183229 0.328432 1.473007
H  1.658447 -2.699847 3.191852
H  0.030001 -2.292283 3.723547
H  0.328076 -2.67388 2.030927
H  2.562346 -0.402555 3.975358
H  1.584798 1.012665 3.571673
H  0.940212 -0.21489 4.642233
H  4.376439 0.883165 -1.966047
H  -0.441888 -0.924918 -2.761607
H  -6.88606 -0.45806 -0.089537
H  -6.263442 -1.289893 -2.325776
H  5.181442 -1.937825 0.911329
H  6.505171 -1.730875 -0.211887
H  -2.970967 -1.43545 -3.437541
elementType: O N C H
totalener: -1639.56773593 hartree
nucrepener: 3839.16079399 hartree
electener: -5478.72852992 hartree
oneelecener: -9879.73697524 hartree
twoeener: 4401.00844532 hartree
cpcmener: -0.04747511 hartree
kineticenergy: 1632.78411502 hartree
xcener: -152.556873929274 hartree
chargesum: -0.0000000
charge: -0.437768 -0.397858 -0.444954 -0.462475 -0.364932 -0.364900 -0.485867 -0.355379 -0.487620 -0.209178 -0.231415 0.170551 0.074646 -0.015777 0.637407 -0.090118 0.470517 -0.377060 0.115619 0.202416 -0.083303 0.244061 0.278462 -0.250677 -0.392596 -0.119875 -0.151420 -0.218731 -0.204822 0.237222 0.321078 -0.111104 -0.211033 0.109584 0.093900 0.098001 0.151038 0.111271 0.105395 0.118038 0.226224 0.230965 0.229282 0.147887 0.098874 0.111267 0.105943 0.093713 0.099887 0.111306 0.270566 0.252398 0.156460 0.138298 0.217653 0.188419 0.250513
qa: -0.4378 -0.3979 -0.4450 -0.4625 -0.3649 -0.3649 -0.4859 -0.3554 -0.4876 -0.2092 -0.2314 0.1706 0.0746 -0.0158 0.6374 -0.0901 0.4705 -0.3771 0.1156 0.2024 -0.0833 0.2441 0.2785 -0.2507 -0.3926 -0.1199 -0.1514 -0.2187 -0.2048 0.2372 0.3211 -0.1111 -0.2110 0.1096 0.0939 0.0980 0.1510 0.1113 0.1054 0.1180 0.2262 0.2310 0.2293 0.1479 0.0989 0.1113 0.1059 0.0937 0.0999 0.1113 0.2706 0.2524 0.1565 0.1383 0.2177 0.1884 0.2505
va: 1.9826 2.0644 2.0162 2.0697 2.1936 2.1695 2.0083 2.1560 2.0350 2.8072 3.2953 3.5831 3.7241 4.1541 3.7515 4.0326 3.8808 3.5895 4.1446 3.9025 3.7164 4.0259 3.9351 3.5027 3.9831 3.6133 3.8788 3.8919 3.9179 3.9545 4.2816 3.9643 3.9557 1.0273 1.0312 1.0203 0.9727 1.0007 1.0068 1.0021 1.0298 1.0141 1.0447 1.0017 1.0124 0.9918 0.9996 1.0078 1.0033 0.9929 1.0866 1.0900 0.9905 1.0117 1.0281 1.0090 1.0389
dispcorr: -0.039069381 hartree
energy: -1639.606805312120
dipole: -6.85027 6.65734 -0.19292 -0.19929 0.54089 0.34160 24.18651 -23.27615 0.91035
magnitude: 0.99129 au
magnitude: 2.51966 debye
