program: Orca
programVersion: 5.0.2
elementType: O O O O O O O O O N N C C C C C C C C C C C C C C C C C C C C C C H H H H H H H H H H H H H H H H H H H H H H H H
charge: 0
multiplicity: 1
keywords: wb97x-d3
keywords: def2-TZVPP
keywords: def2/J RIJCOSX
keywords: DEFGRID2
keywords: scfconv7
keywords: smallprint printgap noloewdin
keywords: NOSOSCF
formula: C22H24N2O9
InChI: InChI=1/C22H24N2O9/c1-21(32)7-5-4-6-8(25)9(7)15(26)10-12(21)17(28)13-14(24(2)3)16(27)11(20(23)31)19(30)22(13,33)18(10)29/h4-6,12-14,17,25-26,28,30,32-33H,23H2,1-3H3
57 atoms
O  -0.336671 2.808406 1.706266
O  1.091591 2.438582 -0.88744
O  -2.146759 -0.795498 1.58307
O  0.875818 -0.551517 -2.139504
O  3.357807 1.412997 -1.799519
O  -1.422097 -1.339094 -2.493214
O  3.225693 -2.008347 1.390083
O  -3.878453 -1.49757 -3.348929
O  5.311833 0.033744 -1.59306
N  1.484651 -0.416318 2.942275
N  5.435401 -1.66689 -0.135352
C  1.161245 1.019181 0.994974
C  -1.371214 1.065008 0.345943
C  -0.268599 1.437103 1.378005
C  1.395789 1.126481 -0.503411
C  1.494849 -0.394274 1.494928
C  -2.596514 0.431297 1.029771
C  -0.898736 0.173925 -0.773143
C  0.44902 0.160325 -1.211341
C  2.81834 0.751803 -0.834051
C  -3.65378 0.102165 -0.027841
C  2.785107 -0.974304 0.902727
C  -1.806137 -0.568193 -1.49458
C  3.458768 -0.27483 -0.172616
C  -3.149916 1.33985 2.121541
C  -3.229922 -0.493337 -1.23549
C  -5.004277 0.261871 0.209147
C  2.655227 0.118056 3.60003
C  1.00543 -1.629533 3.563327
C  -4.182447 -0.930742 -2.177763
C  4.79472 -0.640158 -0.667992
C  -5.938188 -0.159588 -0.736442
C  -5.541018 -0.753541 -1.91206
H  1.843607 1.722891 1.483826
H  -1.720194 2.00638 -0.098122
H  -0.471478 0.918693 2.315189
H  0.700014 -1.073952 1.161628
H  -2.397493 1.549273 2.8795
H  -3.985457 0.869621 2.64214
H  -3.498012 2.291834 1.720857
H  -0.142777 3.32135 0.913616
H  1.168161 2.542115 -1.845216
H  -2.864293 -1.185386 2.095713
H  -5.36175 0.713074 1.122677
H  2.986359 1.0428 3.12542
H  2.408787 0.364184 4.634949
H  3.512047 -0.568575 3.625572
H  1.728443 -2.454264 3.572871
H  0.736206 -1.422383 4.601925
H  0.103659 -1.977908 3.059186
H  4.306252 0.986027 -1.918139
H  -0.419206 -1.222625 -2.594866
H  -6.994057 -0.023831 -0.54022
H  -6.268416 -1.086359 -2.641644
H  4.991796 -2.223391 0.581363
H  6.350994 -1.917571 -0.475432
H  -2.917938 -1.618095 -3.431215
elementType: O N C H
totalener: -1639.56750989 hartree
nucrepener: 3816.90637056 hartree
electener: -5456.47388045 hartree
oneelecener: -9836.37840462 hartree
twoeener: 4379.90452417 hartree
cpcmener: -0.04928177 hartree
kineticenergy: 1632.78807275 hartree
xcener: -152.550382642460 hartree
chargesum: -0.0000000
charge: -0.438974 -0.387575 -0.389579 -0.463747 -0.355613 -0.363801 -0.485657 -0.354529 -0.495040 -0.236372 -0.233291 0.173372 0.107906 -0.007982 0.690502 -0.030426 0.557564 -0.414942 0.095407 0.180387 -0.197154 0.236112 0.266019 -0.239253 -0.386531 -0.108465 -0.156397 -0.207806 -0.190649 0.240274 0.334204 -0.110098 -0.209932 0.091326 0.097666 0.084226 0.123969 0.110193 0.104000 0.114353 0.222185 0.226394 0.210074 0.146869 0.104689 0.107192 0.084766 0.086062 0.101737 0.089711 0.269926 0.254408 0.156879 0.138545 0.217966 0.188412 0.250519
qa: -0.4390 -0.3876 -0.3896 -0.4637 -0.3556 -0.3638 -0.4857 -0.3545 -0.4950 -0.2364 -0.2333 0.1734 0.1079 -0.0080 0.6905 -0.0304 0.5576 -0.4149 0.0954 0.1804 -0.1972 0.2361 0.2660 -0.2393 -0.3865 -0.1085 -0.1564 -0.2078 -0.1906 0.2403 0.3342 -0.1101 -0.2099 0.0913 0.0977 0.0842 0.1240 0.1102 0.1040 0.1144 0.2222 0.2264 0.2101 0.1469 0.1047 0.1072 0.0848 0.0861 0.1017 0.0897 0.2699 0.2544 0.1569 0.1385 0.2180 0.1884 0.2505
va: 1.9738 2.0922 2.0466 2.0663 2.2070 2.1713 2.0152 2.1567 2.0289 2.8807 3.2893 3.7737 3.6772 3.9973 3.6816 3.9730 3.7232 3.5894 4.1499 3.9227 3.8854 3.9619 3.9292 3.4130 3.9931 3.6165 3.8639 3.9362 3.9261 3.9576 4.2787 3.9626 3.9534 1.0588 1.0283 1.0742 1.0060 1.0069 1.0014 1.0018 1.0235 1.0168 1.0174 1.0035 0.9946 0.9949 1.0038 1.0070 0.9906 1.0086 1.0852 1.0863 0.9902 1.0111 1.0290 1.0090 1.0387
dispcorr: -0.038169809 hartree
energy: -1639.605679697998
dipole: -5.70742 4.12047 -1.58694 1.72696 -1.49218 0.23478 24.73220 -23.94265 0.78954
magnitude: 1.78799 au
magnitude: 4.54470 debye
