program: Orca
programVersion: 5.0.2
elementType: O O O O O O O O O N N C C C C C C C C C C C C C C C C C C C C C C H H H H H H H H H H H H H H H H H H H H H H H H
charge: 0
multiplicity: 1
keywords: wb97x-d3
keywords: def2-TZVPP
keywords: def2/J RIJCOSX
keywords: DEFGRID2
keywords: scfconv7
keywords: smallprint printgap noloewdin
keywords: NOSOSCF
formula: C22H24N2O9
InChI: InChI=1/C22H24N2O9/c1-21(32)7-5-4-6-8(25)9(7)15(26)10-12(21)17(28)13-14(24(2)3)16(27)11(20(23)31)19(30)22(13,33)18(10)29/h4-6,12-14,17,25-26,28,30,32-33H,23H2,1-3H3
57 atoms
O  -0.635928 1.725611 2.530712
O  1.419422 2.66896 -0.203178
O  -3.148684 2.205719 1.561318
O  0.957168 0.200755 -2.423478
O  3.493139 1.639358 -1.449605
O  -1.352868 -0.774104 -2.708222
O  3.12645 -2.295913 1.057969
O  -3.241507 -2.523665 -2.272687
O  5.376107 0.168128 -1.436825
N  0.874248 -1.335498 2.37931
N  5.384217 -1.770573 -0.311514
C  0.999569 0.686505 1.018954
C  -1.250536 1.60405 0.157661
C  -0.495004 0.970927 1.338914
C  1.464291 1.273498 -0.319789
C  1.268352 -0.827119 1.090099
C  -2.783024 1.681708 0.307767
C  -0.86775 0.837076 -1.069747
C  0.512657 0.761173 -1.41397
C  2.869629 0.828343 -0.664622
C  -3.4292 0.326257 0.065326
C  2.681148 -1.22483 0.666217
C  -1.707564 -0.092489 -1.630924
C  3.429483 -0.345784 -0.208807
C  -3.346514 2.649064 -0.739355
C  -2.954413 -0.476269 -0.993144
C  -4.532659 -0.070889 0.792346
C  0.352205 -2.680264 2.423907
C  1.728012 -1.023005 3.500574
C  -3.621208 -1.679778 -1.306875
C  4.79182 -0.648337 -0.681706
C  -5.17973 -1.26224 0.473761
C  -4.73902 -2.056652 -0.562236
H  1.608681 1.178544 1.784676
H  -0.916617 2.639014 0.046794
H  -0.96801 0.013135 1.566025
H  0.615317 -1.309303 0.3485
H  -3.166114 2.312854 -1.759914
H  -2.893033 3.635521 -0.62309
H  -4.425765 2.753356 -0.613174
H  -0.224014 2.589857 2.404216
H  1.648835 3.083285 -1.045079
H  -2.44748 2.014713 2.204673
H  -4.905484 0.542762 1.599394
H  -0.25013 -2.8075 3.327294
H  -0.305213 -2.858323 1.571345
H  1.115839 -3.467838 2.429747
H  2.081628 0.007469 3.455173
H  1.158505 -1.119671 4.427638
H  2.608756 -1.671252 3.59227
H  4.42955 1.19179 -1.613087
H  -0.409435 -0.533086 -2.935156
H  -6.046374 -1.57016 1.044944
H  -5.244161 -2.982576 -0.80699
H  4.902723 -2.421896 0.29204
H  6.318487 -1.972872 -0.632787
H  -2.462039 -2.181058 -2.739039
elementType: O N C H
totalener: -1639.56456892 hartree
nucrepener: 3840.25670313 hartree
electener: -5479.82127204 hartree
oneelecener: -9881.41960171 hartree
twoeener: 4401.59832966 hartree
cpcmener: -0.04898441 hartree
kineticenergy: 1632.77720464 hartree
xcener: -152.548895206512 hartree
chargesum: -0.0000000
charge: -0.407489 -0.387670 -0.459164 -0.457712 -0.365254 -0.352366 -0.487820 -0.356074 -0.489649 -0.229397 -0.231221 0.140567 0.171632 -0.135609 0.594928 0.012975 0.555772 -0.365377 0.045152 0.150115 -0.166489 0.251306 0.270015 -0.212274 -0.326264 -0.040299 -0.216021 -0.190421 -0.217319 0.260515 0.330928 -0.109448 -0.214904 0.095967 0.110503 0.121117 0.124942 0.104199 0.096507 0.110534 0.221107 0.226920 0.227777 0.137335 0.102708 0.093636 0.085967 0.103872 0.108627 0.088084 0.268247 0.254162 0.157055 0.138580 0.218045 0.188164 0.250280
qa: -0.4075 -0.3877 -0.4592 -0.4577 -0.3653 -0.3524 -0.4878 -0.3561 -0.4896 -0.2294 -0.2312 0.1406 0.1716 -0.1356 0.5949 0.0130 0.5558 -0.3654 0.0452 0.1501 -0.1665 0.2513 0.2700 -0.2123 -0.3263 -0.0403 -0.2160 -0.1904 -0.2173 0.2605 0.3309 -0.1094 -0.2149 0.0960 0.1105 0.1211 0.1249 0.1042 0.0965 0.1105 0.2211 0.2269 0.2278 0.1373 0.1027 0.0936 0.0860 0.1039 0.1086 0.0881 0.2682 0.2542 0.1571 0.1386 0.2180 0.1882 0.2503
va: 1.9979 2.0921 1.9992 2.0600 2.1878 2.1915 2.0141 2.1539 2.0334 2.8648 3.2933 3.7061 3.6006 4.0124 3.7696 4.0203 3.6264 3.8063 4.2921 4.0016 3.7578 4.0107 3.8939 3.4204 3.9330 3.4667 3.9733 3.9275 3.9420 3.9317 4.2758 3.9480 3.9544 1.0479 1.0400 1.0223 0.9902 0.9962 1.0139 1.0078 1.0135 1.0177 1.0656 1.0357 0.9913 0.9983 1.0058 0.9958 0.9931 1.0046 1.0893 1.0724 0.9902 1.0106 1.0300 1.0091 1.0385
dispcorr: -0.038301175 hartree
energy: -1639.602870092489
dipole: -7.42061 7.74503 0.32442 -2.35697 2.51055 0.15358 16.78372 -16.45272 0.33100
magnitude: 0.48826 au
magnitude: 1.24105 debye
