program: Orca
programVersion: 5.0.2
elementType: N N N C C C C C C C C C C C C C C H H H H H H H H H H H H H
charge: 0
multiplicity: 1
keywords: wb97x-d3
keywords: def2-TZVPP
keywords: def2/J RIJCOSX
keywords: DEFGRID2
keywords: scfconv7
keywords: smallprint printgap noloewdin
keywords: NOSOSCF
formula: C14H13N3
InChI: InChI=1/C14H13N3/c1-3-7-13-10-11(2)15-14(17-13)16-12-8-5-4-6-9-12/h4-6,8-10,16H,1-2H3
30 atoms
N  1.17473 1.260159 0.001042
N  -0.870023 2.233951 0.001425
N  -0.687168 -0.132908 -0.002566
C  2.228746 0.351872 0.000403
C  -0.175203 1.086729 0.000232
C  -2.188535 2.143949 0.000684
C  3.51778 0.901413 -0.0005
C  2.097198 -1.039112 0.000983
C  -2.830883 0.904144 -0.001565
C  -2.02096 -0.215327 -0.004358
C  4.636914 0.088666 -0.000824
C  3.231556 -1.841053 0.000729
C  -2.985525 3.4047 0.001192
C  4.505183 -1.294801 -0.000184
C  -2.582114 -1.529125 -0.005518
C  -3.044872 -2.641336 0.001759
C  -3.597539 -3.980848 0.00208
H  1.449492 2.231748 0.00179
H  3.639601 1.978931 -0.001003
H  1.123168 -1.49751 0.001771
H  -3.908249 0.824828 -0.002283
H  5.619311 0.543007 -0.001557
H  3.103981 -2.91619 0.001331
H  -2.343633 4.282065 0.000199
H  -3.635365 3.44653 -0.873965
H  -3.633158 3.446956 0.877972
H  5.378947 -1.932422 -0.000376
H  -4.686815 -3.956545 -0.005913
H  -3.264438 -4.536673 -0.8748
H  -3.277214 -4.532096 0.886566
elementType: N C H
totalener: -705.59282688 hartree
nucrepener: 1051.88787805 hartree
electener: -1757.48070493 hartree
oneelecener: -3041.92542489 hartree
twoeener: 1284.44471995 hartree
cpcmener: -0.02357686 hartree
kineticenergy: 702.47058018 hartree
xcener: -69.923118639195 hartree
chargesum: -0.0000000
charge: -0.136207 -0.407246 -0.430351 0.206685 0.427115 0.162701 -0.242881 -0.261156 -0.225100 0.031787 -0.118763 -0.145314 -0.243909 -0.210351 -0.072455 0.099221 -0.196091 0.159438 0.142014 0.166529 0.142982 0.159277 0.158300 0.093381 0.109724 0.109769 0.159906 0.119308 0.121005 0.120683
qa: -0.1362 -0.4072 -0.4304 0.2067 0.4271 0.1627 -0.2429 -0.2612 -0.2251 0.0318 -0.1188 -0.1453 -0.2439 -0.2104 -0.0725 0.0992 -0.1961 0.1594 0.1420 0.1665 0.1430 0.1593 0.1583 0.0934 0.1097 0.1098 0.1599 0.1193 0.1210 0.1207
va: 3.1807 3.0168 3.0235 3.7970 4.1025 3.9541 3.9235 3.9066 3.9049 3.9747 3.8874 3.9031 3.9153 3.9041 4.0502 3.6847 3.9250 1.0338 1.0078 1.0390 1.0081 0.9894 0.9922 1.0214 0.9963 0.9963 0.9903 0.9912 0.9908 0.9909
dispcorr: -0.009663558 hartree
energy: -705.602490439953
dipole: -4.14497 2.95215 -1.19283 -2.46332 2.57351 0.11020 0.01188 -0.00921 0.00267
magnitude: 1.19791 au
magnitude: 3.04484 debye
