program: Orca
programVersion: 5.0.2
elementType: N N N C C C C C C C C C C C C C C H H H H H H H H H H H H H
charge: 0
multiplicity: 1
keywords: wb97x-d3
keywords: def2-TZVPP
keywords: def2/J RIJCOSX
keywords: DEFGRID2
keywords: scfconv7
keywords: smallprint printgap noloewdin
keywords: NOSOSCF
formula: C14H13N3
InChI: InChI=1/C14H13N3/c1-3-7-13-10-11(2)15-14(17-13)16-12-8-5-4-6-9-12/h4-6,8-10,16H,1-2H3
30 atoms
N  1.17221 1.260852 0.004365
N  -0.875755 2.225861 0.005769
N  -0.686518 -0.13717 -0.000151
C  2.227834 0.355463 0.00273
C  -0.177025 1.086271 0.002736
C  -2.19625 2.132298 0.005107
C  2.097286 -1.035518 -0.017325
C  3.515841 0.906828 0.020697
C  -2.833351 0.893622 0.002939
C  -2.015842 -0.226231 0.000929
C  3.233227 -1.834898 -0.018781
C  4.636122 0.096257 0.018897
C  -2.971345 3.407434 0.000886
C  4.505876 -1.286857 -0.000851
C  -2.574744 -1.54053 -0.002945
C  -3.048743 -2.647639 -0.008066
C  -3.611828 -3.982508 -0.009787
H  1.441288 2.234228 0.010848
H  1.122909 -1.494721 -0.031804
H  3.636246 1.984579 0.03638
H  -3.909958 0.807922 0.003444
H  3.108551 -2.910517 -0.034637
H  5.617906 0.552288 0.033245
H  -2.7662 3.972704 -0.909742
H  -4.04346 3.230129 0.058598
H  -2.67804 4.037067 0.841754
H  5.380892 -1.923246 -0.002273
H  -4.692396 -3.954204 0.130762
H  -3.407354 -4.487144 -0.954974
H  -3.181301 -4.586762 0.789605
elementType: N C H
totalener: -705.60219606 hartree
nucrepener: 1052.05146695 hartree
electener: -1757.65366301 hartree
oneelecener: -3042.13675729 hartree
twoeener: 1284.48309429 hartree
cpcmener: -0.02044780 hartree
kineticenergy: 702.47177216 hartree
xcener: -69.923335452934 hartree
chargesum: 0.0000000
charge: -0.137047 -0.417984 -0.423245 0.205466 0.417464 0.175100 -0.252965 -0.240961 -0.215640 0.033017 -0.141274 -0.116598 -0.246375 -0.205451 -0.059536 0.096080 -0.198692 0.156377 0.166999 0.136910 0.139310 0.154149 0.155108 0.105754 0.095590 0.104074 0.155789 0.118346 0.119788 0.120447
qa: -0.1370 -0.4180 -0.4232 0.2055 0.4175 0.1751 -0.2530 -0.2410 -0.2156 0.0330 -0.1413 -0.1166 -0.2464 -0.2055 -0.0595 0.0961 -0.1987 0.1564 0.1670 0.1369 0.1393 0.1541 0.1551 0.1058 0.0956 0.1041 0.1558 0.1183 0.1198 0.1204
va: 3.1791 3.0108 3.0303 3.8083 4.1221 3.9249 3.9126 3.9298 3.9190 3.9691 3.9078 3.8985 3.9592 3.9105 4.0483 3.6818 3.9258 1.0360 1.0371 1.0091 1.0087 0.9934 0.9908 1.0029 1.0056 1.0050 0.9915 0.9912 0.9910 0.9909
dispcorr: -0.009639026 hartree
energy: -705.611835081577
dipole: -4.08008 2.94766 -1.13242 -2.37364 2.43618 0.06253 -0.03116 0.02520 -0.00596
magnitude: 1.13416 au
magnitude: 2.88281 debye
