program: Orca
programVersion: 5.0.2
elementType: N N N C C C C C C C C C C C C C C H H H H H H H H H H H H H
charge: 0
multiplicity: 1
keywords: wb97x-d3
keywords: def2-TZVPP
keywords: def2/J RIJCOSX
keywords: DEFGRID2
keywords: scfconv7
keywords: smallprint printgap noloewdin
keywords: NOSOSCF
formula: C14H13N3
InChI: InChI=1/C14H13N3/c1-3-7-13-10-11(2)15-14(17-13)16-12-8-5-4-6-9-12/h4-6,8-10,16H,1-2H3
30 atoms
N  1.126685 -0.612879 -0.004476
N  -0.322317 1.21351 0.004877
N  -1.08735 -1.033778 -0.005282
C  2.38326 -0.017002 -0.000878
C  -0.1333 -0.098631 -0.001403
C  -1.579821 1.643534 0.005541
C  3.481582 -0.88336 -0.012736
C  2.615676 1.358892 0.014184
C  -2.64696 0.761549 -0.000985
C  -2.335884 -0.599111 -0.003937
C  4.773196 -0.393256 -0.009287
C  3.918892 1.834051 0.017456
C  -1.779781 3.124986 0.024371
C  5.005047 0.974636 0.005961
C  -3.37807 -1.575811 -0.008554
C  -4.272841 -2.378996 -0.010542
C  -5.344954 -3.355296 -0.010771
H  1.122142 -1.620243 -0.010642
H  3.319746 -1.95558 -0.025038
H  1.786237 2.046038 0.023221
H  -3.672046 1.100001 -0.002932
H  5.602526 -1.088247 -0.018744
H  4.079981 2.904279 0.029442
H  -1.425845 3.538913 0.969385
H  -1.200175 3.595529 -0.769249
H  -2.826408 3.39658 -0.097335
H  6.014853 1.361399 0.008792
H  -6.134982 -3.070178 0.684262
H  -5.790047 -3.442573 -1.002401
H  -4.977961 -4.339568 0.279385
totalener: -705.58052105 hartree
nucrepener: 1045.49006637 hartree
electener: -1751.07058742 hartree
oneelecener: -3028.17796385 hartree
twoeener: 1277.10737643 hartree
kineticenergy: 702.50227789 hartree
xcener: -69.926922486116 hartree
chargesum: 0.0000000
charge: -0.150656 -0.385000 -0.372190 0.203166 0.421154 0.167554 -0.207148 -0.202126 -0.184736 0.018683 -0.095105 -0.096733 -0.246510 -0.161889 -0.012404 0.060272 -0.217782 0.134481 0.093350 0.142222 0.111370 0.120310 0.119598 0.100234 0.100106 0.085131 0.120908 0.109657 0.110975 0.113106
qa: -0.1507 -0.3850 -0.3722 0.2032 0.4212 0.1676 -0.2071 -0.2021 -0.1847 0.0187 -0.0951 -0.0967 -0.2465 -0.1619 -0.0124 0.0603 -0.2178 0.1345 0.0934 0.1422 0.1114 0.1203 0.1196 0.1002 0.1001 0.0851 0.1209 0.1097 0.1110 0.1131
va: 3.1860 3.0380 3.0221 3.8800 4.0811 3.9124 3.9868 3.9622 3.9321 4.0243 3.9904 3.9431 3.9344 3.9743 4.1371 3.6364 3.9336 1.0531 1.0186 1.0495 1.0152 1.0010 1.0020 1.0037 1.0075 1.0089 1.0016 0.9926 0.9923 0.9921
dispcorr: -0.009639965 hartree
energy: -705.590161016566
dipole: -3.87082 2.88050 -0.99032 2.21176 -2.35479 -0.14304 0.05836 -0.05217 0.00619
magnitude: 1.00062 au
magnitude: 2.54336 debye
