program: Orca
programVersion: 5.0.2
elementType: O O O O O O O O O N N N C C C C C C C C C C C C C C H H H H H H H H H H H H H H H H H H H H H H H H H
charge: 0
multiplicity: 1
keywords: wb97x-d3
keywords: def2-TZVPP
keywords: def2/J RIJCOSX
keywords: DEFGRID2
keywords: scfconv7
keywords: smallprint printgap noloewdin
keywords: NOSOSCF
formula: C14H25N3O9
InChI: InChI=1/C14H25N3O9/c1-3-5(17-12(16)13(23)24)2-4(15)14(25-3)26-11-9(21)7(19)6(18)8(20)10(11)22/h3-11,14,18-23H,2,15-16H2,1H3
51 atoms
O  -0.798982 0.278345 -0.642356
O  0.376368 1.19296 1.145625
O  -1.379573 -1.995893 0.975427
O  -2.960093 1.919218 -1.346935
O  -4.000079 -1.321135 1.718566
O  -5.433882 0.664841 -1.741088
O  -6.021434 -1.666145 -0.192892
O  5.403589 -2.261683 0.580513
O  7.021549 -0.924768 -0.182083
N  1.381926 3.21864 -0.885826
N  3.625549 -0.337447 0.37119
N  5.339241 1.177492 -0.256471
C  -2.11417 0.023818 -0.177713
C  -2.269738 -1.486078 0.006819
C  -3.134306 0.527266 -1.195435
C  -3.682353 -1.853424 0.447117
C  -4.551162 0.190288 -0.745068
C  -4.701243 -1.317893 -0.550353
C  -0.159971 1.420219 -0.132079
C  0.916034 1.861205 -1.126616
C  2.079446 0.877844 -1.095058
C  2.611548 0.688481 0.329835
C  1.457936 0.268057 1.239821
C  1.845492 0.205399 2.700211
C  4.826758 -0.026075 0.079418
C  5.87285 -1.112357 0.141812
H  -2.283397 0.521897 0.7858
H  -2.098108 -1.967825 -0.966442
H  -2.945133 0.013593 -2.151143
H  -3.759236 -2.948599 0.461101
H  -4.745898 0.701316 0.209571
H  -4.510455 -1.807511 -1.511202
H  -0.879897 2.230756 0.013847
H  0.467977 1.846472 -2.122401
H  2.868379 1.233787 -1.760526
H  1.757961 -0.093513 -1.47938
H  2.998707 1.648016 0.706978
H  1.136681 -0.729716 0.917792
H  -0.489496 -1.973511 0.610818
H  -3.507183 2.212778 -2.08302
H  -3.485074 -1.789288 2.38387
H  -6.334565 0.550855 -1.419694
H  -6.190595 -1.334851 0.697402
H  2.204403 1.172714 3.057328
H  0.998377 -0.09621 3.317502
H  2.637726 -0.525229 2.852395
H  1.68231 3.31643 0.076905
H  0.601761 3.856311 -0.992547
H  6.291408 1.236414 -0.574887
H  4.732945 1.93865 -0.510643
H  6.112758 -2.924112 0.594311
elementType: O N C H
totalener: -1390.06892657 hartree
nucrepener: 2651.89187082 hartree
electener: -4041.96079739 hartree
oneelecener: -7178.56235334 hartree
twoeener: 3136.60155595 hartree
cpcmener: -0.08049513 hartree
kineticenergy: 1384.16411100 hartree
xcener: -127.413458659595 hartree
chargesum: 0.0000000
charge: -0.410161 -0.401364 -0.436027 -0.418365 -0.434521 -0.430893 -0.445233 -0.283228 -0.453609 -0.416780 -0.434849 -0.278427 0.117243 0.059427 0.118590 0.127903 0.030397 0.155944 0.234622 0.184452 -0.210359 0.146660 0.114263 -0.303481 0.194335 0.413392 0.078532 0.096968 0.094326 0.108057 0.092709 0.100335 0.109011 0.091608 0.086307 0.094609 0.077829 0.049533 0.252195 0.229293 0.231832 0.236649 0.236374 0.088498 0.098536 0.085084 0.138170 0.140543 0.182427 0.192254 0.268391
qa: -0.4102 -0.4014 -0.4360 -0.4184 -0.4345 -0.4309 -0.4452 -0.2832 -0.4536 -0.4168 -0.4348 -0.2784 0.1172 0.0594 0.1186 0.1279 0.0304 0.1559 0.2346 0.1845 -0.2104 0.1467 0.1143 -0.3035 0.1943 0.4134 0.0785 0.0970 0.0943 0.1081 0.0927 0.1003 0.1090 0.0916 0.0863 0.0946 0.0778 0.0495 0.2522 0.2293 0.2318 0.2366 0.2364 0.0885 0.0985 0.0851 0.1382 0.1405 0.1824 0.1923 0.2684
va: 1.9664 1.9791 2.0029 1.9936 2.0165 1.9868 1.9960 2.2204 2.0341 3.0801 2.9897 3.2669 3.7597 4.1020 3.8517 3.9041 3.9923 3.8590 4.0976 3.9026 3.8384 3.7669 3.8216 3.9354 4.1179 4.2392 1.0529 1.0131 1.0247 1.0061 1.0316 1.0219 1.0235 1.0339 1.0380 1.0392 1.0191 1.0433 0.9951 1.0105 1.0092 1.0072 1.0073 1.0081 1.0103 1.0223 1.0345 1.0209 1.0234 1.0116 0.9854
dispcorr: -0.028972342 hartree
energy: -1390.097898914696
dipole: -6.46750 6.53709 0.06959 5.82682 -5.77044 0.05638 1.39188 -1.59465 -0.20277
magnitude: 0.22166 au
magnitude: 0.56343 debye
