program: Orca
programVersion: 5.0.2
elementType: O O O O O O O O O N N N C C C C C C C C C C C C C C H H H H H H H H H H H H H H H H H H H H H H H H H
charge: 0
multiplicity: 1
keywords: wb97x-d3
keywords: def2-TZVPP
keywords: def2/J RIJCOSX
keywords: DEFGRID2
keywords: scfconv7
keywords: smallprint printgap noloewdin
keywords: NOSOSCF
formula: C14H25N3O9
InChI: InChI=1/C14H25N3O9/c1-3-5(17-12(16)13(23)24)2-4(15)14(25-3)26-11-9(21)7(19)6(18)8(20)10(11)22/h3-11,14,18-23H,2,15-16H2,1H3
51 atoms
O  -0.826232 0.590307 -0.941746
O  0.224256 1.44773 0.964377
O  -0.938197 -2.123125 -0.348902
O  -3.19508 2.146976 -0.45679
O  -3.195386 -2.126525 1.281908
O  -5.611044 0.821033 -0.566422
O  -5.686839 -1.945297 0.118472
O  4.94541 -2.453304 0.712338
O  6.736281 -1.235045 0.176625
N  1.561473 3.366469 -0.897968
N  3.372043 -0.353302 0.426555
N  5.261596 0.988421 -0.077325
C  -1.992354 0.08056 -0.327761
C  -2.069961 -1.392195 -0.74123
C  -3.264383 0.7858 -0.788113
C  -3.27461 -2.090584 -0.124618
C  -4.469114 0.125526 -0.125821
C  -4.558965 -1.35667 -0.481561
C  -0.193355 1.695238 -0.345352
C  0.991588 2.07113 -1.239608
C  2.06169 0.990434 -1.144708
C  2.4667 0.758231 0.314032
C  1.223275 0.454437 1.152446
C  1.528527 0.404456 2.633413
C  4.609742 -0.1622 0.228336
C  5.552052 -1.332582 0.366685
H  -1.914514 0.151397 0.764233
H  -2.192097 -1.425724 -1.836729
H  -3.355821 0.659389 -1.881077
H  -3.327863 -3.109886 -0.53497
H  -4.351875 0.223824 0.965388
H  -4.709449 -1.43974 -1.564024
H  -0.886241 2.536001 -0.26255
H  0.637911 2.130209 -2.271874
H  2.922079 1.288675 -1.747236
H  1.697077 0.048891 -1.56264
H  2.912575 1.685702 0.713601
H  0.850188 -0.531416 0.848279
H  -0.155958 -1.65736 -0.659578
H  -4.060752 2.530796 -0.628151
H  -2.354952 -2.527274 1.52402
H  -6.385488 0.364816 -0.223994
H  -5.458674 -2.140718 1.033956
H  1.921215 1.359477 2.987491
H  0.632428 0.172484 3.208725
H  2.270769 -0.367004 2.83159
H  1.62737 3.470784 0.106697
H  0.956432 4.11002 -1.21896
H  6.246291 0.95412 -0.269546
H  4.757302 1.805298 -0.36819
H  5.614829 -3.146939 0.776321
totalener: -1390.01361369 hartree
nucrepener: 2680.87101429 hartree
electener: -4070.88462798 hartree
oneelecener: -7235.45633153 hartree
twoeener: 3164.57170355 hartree
kineticenergy: 1384.35051042 hartree
xcener: -127.433438426321 hartree
chargesum: 0.0000000
charge: -0.380835 -0.339859 -0.364118 -0.338986 -0.371696 -0.359595 -0.368755 -0.222511 -0.365523 -0.353960 -0.347260 -0.270456 0.116172 0.039531 0.100465 0.091300 0.042178 0.122231 0.239931 0.164113 -0.231092 0.132817 0.072671 -0.306374 0.174264 0.344683 0.079470 0.078027 0.067739 0.104363 0.084132 0.081489 0.115391 0.087136 0.081754 0.097769 0.058077 0.055024 0.208274 0.180516 0.192576 0.192401 0.196555 0.076256 0.093010 0.096026 0.118250 0.113953 0.162143 0.159195 0.201141
qa: -0.3808 -0.3399 -0.3641 -0.3390 -0.3717 -0.3596 -0.3688 -0.2225 -0.3655 -0.3540 -0.3473 -0.2705 0.1162 0.0395 0.1005 0.0913 0.0422 0.1222 0.2399 0.1641 -0.2311 0.1328 0.0727 -0.3064 0.1743 0.3447 0.0795 0.0780 0.0677 0.1044 0.0841 0.0815 0.1154 0.0871 0.0818 0.0978 0.0581 0.0550 0.2083 0.1805 0.1926 0.1924 0.1966 0.0763 0.0930 0.0960 0.1183 0.1140 0.1621 0.1592 0.2011
va: 2.0037 2.0315 2.0822 2.0930 2.0863 2.0600 2.0665 2.2573 2.1221 3.0964 3.0247 3.2472 3.7528 4.1120 3.9571 3.9555 3.9653 3.9348 4.0829 3.9184 3.8383 3.7869 3.8809 3.9750 4.0928 4.2841 1.0579 1.0191 1.0263 1.0023 1.0330 1.0210 1.0262 1.0209 1.0409 1.0368 1.0188 1.0465 1.0472 1.0601 1.0555 1.0543 1.0461 1.0122 1.0083 1.0180 1.0462 1.0405 1.0418 1.0359 1.0436
dispcorr: -0.029312589 hartree
energy: -1390.042926276518
dipole: -5.73657 5.92864 0.19207 6.80250 -6.64828 0.15422 0.65952 -0.82603 -0.16651
magnitude: 0.29732 au
magnitude: 0.75573 debye
