program: Orca
programVersion: 6.0.x
elementType: Au C C C C H C H H C P C C H C H H H H H H H H H H H H C C C C H C H C H H C C C H H H H H
elementType: Au
keywords: optts freq wb97x-d3 def2-svp autoaux tightscf slowconv
charge: 1
multiplicity: 1
frequency: 0.00 0.00 0.00 0.00 0.00 0.00 -487.46 10.46 17.43 23.88 31.66 34.22 57.23 83.66 94.54 107.88 129.09 151.89 171.93 181.74 184.37 192.99 206.08 219.95 225.08 225.84 245.12 263.79 265.71 290.27 362.45 364.84 379.14 421.65 444.00 463.77 507.26 529.00 541.80 582.45 612.74 653.13 697.58 711.82 744.99 748.30 767.19 768.74 784.61 793.79 799.11 810.84 830.11 839.76 859.56 862.43 868.99 869.66 875.30 917.00 934.79 945.33 958.92 960.86 961.62 968.29 977.80 1012.76 1021.61 1026.01 1030.18 1031.78 1063.72 1070.39 1082.97 1111.94 1127.14 1165.09 1168.23 1184.08 1211.41 1222.69 1234.97 1248.62 1297.61 1305.58 1306.17 1317.48 1320.92 1332.99 1351.17 1390.99 1411.80 1412.02 1414.20 1414.84 1421.01 1422.68 1423.00 1428.82 1435.31 1436.47 1444.57 1462.97 1509.30 1574.42 1637.54 1665.25 1706.04 1880.91 3071.37 3072.76 3073.26 3097.85 3107.69 3149.61 3155.64 3161.14 3178.98 3182.76 3189.33 3189.90 3190.40 3192.43 3195.67 3196.97 3197.37 3210.21 3211.33 3233.41 3234.37 3239.66 3250.43 3257.64 3280.35
frequency: 10.46 17.43 23.88 31.66 34.22 57.23 83.66 94.54 107.88 129.09 151.89 171.93 181.74 184.37 192.99 206.08 219.95 225.08 225.84 245.12 263.79 265.71 290.27 362.45 364.84 379.14 421.65 444.00 463.77 507.26 529.00 541.80 582.45 612.74 653.13 697.58 711.82 744.99 748.30 767.19 768.74 784.61 793.79 799.11 810.84 830.11 839.76 859.56 862.43 868.99 869.66 875.30 917.00 934.79 945.33 958.92 960.86 961.62 968.29 977.80 1012.76 1021.61 1026.01 1030.18 1031.78 1063.72 1070.39 1082.97 1111.94 1127.14 1165.09 1168.23 1184.08 1211.41 1222.69 1234.97 1248.62 1297.61 1305.58 1306.17 1317.48 1320.92 1332.99 1351.17 1390.99 1411.80 1412.02 1414.20 1414.84 1421.01 1422.68 1423.00 1428.82 1435.31 1436.47 1444.57 1462.97 1509.30 1574.42 1637.54 1665.25 1706.04 1880.91 3071.37 3072.76 3073.26 3097.85 3107.69 3149.61 3155.64 3161.14 3178.98 3182.76 3189.33 3189.90 3190.40 3192.43 3195.67 3196.97 3197.37 3210.21 3211.33 3233.41 3234.37 3239.66 3250.43 3257.64 3280.35
formula: C18H25AuP
InChI: InChI=1/C15H16.C3H9P.Au/c1-3-4-5-12(2)13-6-8-14(9-7-13)15-10-11-15;1-4(2)3;/h1,6-9,15H,2,4-5,10-11H2;1-3H3;/rC18H25AuP/c1-15(7-5-6-14-19-20(2,3)4)16-8-10-17(11-9-16)18-12-13-18/h8-11,14,18H,1,5,7,12-13H2,2-4H3
45 atoms
Au 0.308876 -2.480161 0.027981
C  1.003395 -0.640175 -0.692912
C  0.183746 -0.056986 -1.479894
C  -0.073342 2.305775 -1.890105
C  0.986868 1.697723 -2.496418
H  2.015578 2.022864 -2.325258
C  -1.1205 0.12948 -2.163308
H  -1.87809 -0.500649 -1.67386
H  -1.035222 -0.20256 -3.208928
C  -1.42149 1.62886 -2.048228
P  -0.379362 -4.530708 0.873836
C  -1.711588 -4.394744 2.103396
C  -1.016742 -5.663053 -0.397806
H  1.996644 -0.290913 -0.397139
C  0.953619 -5.443427 1.707132
H  1.343258 -4.846159 2.544157
H  0.575272 -6.403302 2.089793
H  1.771217 -5.631609 0.996319
H  -1.373907 -3.779647 2.950008
H  -1.995521 -5.393307 2.468614
H  -2.587749 -3.91348 1.645261
H  -1.88016 -5.203285 -0.90009
H  -1.326838 -6.614651 0.059709
H  -0.235051 -5.856072 -1.146752
H  0.851369 1.020528 -3.343386
H  -1.978605 2.015057 -2.91545
H  -2.032976 1.814605 -1.156268
C  0.06296 3.480995 -1.006714
C  -1.068876 4.224526 -0.631269
C  1.314089 3.914319 -0.534983
C  -0.954771 5.357787 0.165733
H  -2.061528 3.930244 -0.97851
C  1.422222 5.035381 0.276916
H  2.221361 3.362617 -0.78956
C  0.293328 5.785483 0.640699
H  -1.861786 5.913015 0.420291
H  2.407661 5.342653 0.637583
C  0.456408 6.987387 1.505449
C  -0.429398 8.199893 1.34009
C  -0.570978 7.344015 2.554844
H  1.497217 7.192726 1.771459
H  -1.21298 8.148889 0.578051
H  0.041547 9.181171 1.443066
H  -0.19925 7.725159 3.509814
H  -1.452608 6.700447 2.63305
totalener: -1177.10979681915296 hartree
nucrepener: 1684.96397757741966 hartree
electener: -2861.99522071070396 hartree
oneelecener: -4984.56026500994813 hartree
twoeener: 2122.56504429924416 hartree
cpcmener: -0.06949098016065 hartree
kineticenergy: 1077.30680508382125 hartree
temp: 298.15 k
press: 1.00 atm
thermalcorrenthalpy: 0.00094421 hartree
totalenthalpy: -1176.72509925 hartree
totalentropycorr: -0.07652305 hartree
gibbsenthalpy: -1176.80162231 hartree
gibbsminuselec: 0.32730544 hartree
totalenthalpy: -1176.72518323 hartree
totalenthalpy: -1176.72601716 hartree
totalenthalpy: -1176.72511733 hartree
energy: -2100.8057 -282.6363 -281.8222 -281.2058 -280.8658 -280.8567 -280.8519 -280.8354 -280.8131 -280.6781 -280.6571 -280.5297 -280.4824 -280.4799 -280.4745 -280.4520 -280.4378 -280.3018 -280.2942 -182.8076 -132.6397 -132.6396 -132.5781 -116.5906 -67.2525 -66.7670 -66.7593 -27.4199 -27.0074 -26.3681 -24.8939 -24.7497 -23.8987 -23.7443 -23.1800 -22.2960 -22.2955 -21.5698 -20.5421 -19.7424 -19.2708 -18.7636 -18.3720 -18.2254 -17.6547 -17.0921 -16.7233 -16.1403 -16.0568 -15.7364 -15.5438 -15.1754 -14.9947 -14.9112 -14.9087 -14.6177 -14.4368 -14.0685 -14.0465 -14.0361 -13.9745 -13.8318 -13.5651 -13.5629 -13.2113 -12.7684 -12.6490 -12.5488 -12.5238 -12.3929 -12.0478 -11.9432 -11.8260 -11.4738 -11.3442 -11.3375 -11.3031 -10.9267 -10.3139 -10.0137 -9.9743 -9.7619 -8.5412 -0.8865 0.7385 1.0322 1.3169 1.4896 2.4161 2.7595 3.1132 3.4646 3.9847 4.0682 electronvolt
chargesum: 1.0000000
charge: 0.062842 -0.322088 -0.043521 -0.128397 -0.069756 0.089076 0.096617 0.108140 0.098340 0.083199 0.102075 -0.176190 -0.175119 0.143711 -0.173800 0.104492 0.093744 0.104307 0.104700 0.094319 0.103090 0.102945 0.094510 0.104664 0.121249 0.087181 0.082043 0.039983 -0.054002 -0.051283 -0.087142 0.048088 -0.070980 0.041882 0.096306 0.043033 0.035767 -0.137214 -0.080335 -0.081013 0.056758 0.075727 0.078449 0.078491 0.075111
charge: -0.221109 -0.163902 0.146170 0.055366 -0.020597 0.046034 -0.017387 0.074805 0.063326 -0.015709 0.755355 -0.183595 -0.183281 0.100187 -0.182671 0.055597 0.047806 0.055574 0.055411 0.047772 0.054938 0.054922 0.047876 0.055404 0.064805 0.061945 0.050463 -0.063050 -0.008770 -0.004957 -0.037619 0.046163 -0.036500 0.045596 0.000884 0.043929 0.044072 -0.045877 -0.039673 -0.039412 0.041257 0.035067 0.039290 0.039164 0.034931
qa: 0.0628 -0.3221 -0.0435 -0.1284 -0.0698 0.0891 0.0966 0.1081 0.0983 0.0832 0.1021 -0.1762 -0.1751 0.1437 -0.1738 0.1045 0.0937 0.1043 0.1047 0.0943 0.1031 0.1029 0.0945 0.1047 0.1212 0.0872 0.0820 0.0400 -0.0540 -0.0513 -0.0871 0.0481 -0.0710 0.0419 0.0963 0.0430 0.0358 -0.1372 -0.0803 -0.0810 0.0568 0.0757 0.0784 0.0785 0.0751
va: 1.5742 3.8944 3.9195 4.0176 3.9115 0.9849 3.9029 0.9857 0.9759 3.9381 4.1770 3.8946 3.8951 0.9733 3.8952 0.9846 0.9894 0.9846 0.9843 0.9891 0.9847 0.9849 0.9892 0.9842 0.9745 0.9828 0.9796 3.7779 3.8931 3.8678 3.8854 0.9909 3.8616 0.9891 3.8033 0.9915 0.9919 3.9038 3.9112 3.9113 0.9871 0.9870 0.9811 0.9811 0.9872
dispcorr: -0.018891155 hartree
energy: -1177.129245633963
zeropoint: 0.37998148 hartree
thermalvibcorrection: 0.02036708 hartree
thermalrotcorrection: 0.00141627 hartree
thermaltrasncorrection: 0.00141627 hartree
thermaltotal: -1176.72606453 hartree
thermalcorr: 0.02319963 hartree
nonthermalcorr: 0.37998148 hartree
totalcorr: 0.40318111 hartree
totalenthalpy: -1176.72512032 hartree
