program: Orca
programVersion: 6.0.x
elementType: Au C C C C H C H H C P C C H C H H H H H H H H H H H H C C C C H C H C H H O H
elementType: Au
keywords: optts freq wb97x-d3 def2-svp autoaux tightscf
charge: 1
multiplicity: 1
frequency: 0.00 0.00 0.00 0.00 0.00 0.00 -461.43 11.53 15.15 23.29 31.99 36.92 89.73 106.07 123.39 151.22 163.70 176.47 183.65 191.65 194.52 221.89 224.79 235.53 238.65 263.97 265.74 308.12 365.24 367.37 411.11 425.87 428.68 484.72 504.21 530.05 544.73 554.01 628.91 671.39 696.79 708.66 747.27 751.03 767.19 767.77 783.48 799.48 811.51 826.70 861.72 863.94 872.57 908.23 915.15 917.73 932.62 959.55 960.41 962.32 970.11 993.89 1015.95 1019.04 1025.50 1029.49 1112.32 1122.98 1163.89 1175.47 1201.37 1226.76 1272.90 1305.70 1306.42 1311.32 1317.20 1320.99 1349.89 1372.24 1387.38 1411.09 1414.09 1414.43 1418.58 1421.76 1422.60 1428.56 1432.34 1443.26 1528.18 1542.83 1649.04 1683.55 1710.07 1872.72 3070.97 3072.22 3072.90 3100.50 3110.55 3164.88 3180.86 3182.80 3188.75 3189.77 3190.43 3195.72 3196.32 3196.75 3207.51 3224.04 3231.26 3236.23 3238.86 3280.91 3831.11
frequency: 11.53 15.15 23.29 31.99 36.92 89.73 106.07 123.39 151.22 163.70 176.47 183.65 191.65 194.52 221.89 224.79 235.53 238.65 263.97 265.74 308.12 365.24 367.37 411.11 425.87 428.68 484.72 504.21 530.05 544.73 554.01 628.91 671.39 696.79 708.66 747.27 751.03 767.19 767.77 783.48 799.48 811.51 826.70 861.72 863.94 872.57 908.23 915.15 917.73 932.62 959.55 960.41 962.32 970.11 993.89 1015.95 1019.04 1025.50 1029.49 1112.32 1122.98 1163.89 1175.47 1201.37 1226.76 1272.90 1305.70 1306.42 1311.32 1317.20 1320.99 1349.89 1372.24 1387.38 1411.09 1414.09 1414.43 1418.58 1421.76 1422.60 1428.56 1432.34 1443.26 1528.18 1542.83 1649.04 1683.55 1710.07 1872.72 3070.97 3072.22 3072.90 3100.50 3110.55 3164.88 3180.86 3182.80 3188.75 3189.77 3190.43 3195.72 3196.32 3196.75 3207.51 3224.04 3231.26 3236.23 3238.86 3280.91 3831.11
formula: C15H21AuOP
InChI: InChI=1/C12H12O.C3H9P.Au/c1-3-4-6-10(2)11-7-5-8-12(13)9-11;1-4(2)3;/h1,5,7-9,13H,2,4,6H2;1-3H3;/rC15H21AuOP/c1-13(14-9-7-10-15(17)12-14)8-5-6-11-16-18(2,3)4/h7,9-12,17H,1,5,8H2,2-4H3
39 atoms
Au 0.261927 -1.763921 0.13459
C  0.983176 0.19296 -0.036833
C  0.663286 0.775979 -1.129415
C  0.417672 3.076164 -1.494019
C  1.709575 2.641205 -1.492829
H  2.434925 3.005388 -0.76121
C  -0.082928 0.903198 -2.40853
H  -0.914963 0.183513 -2.419506
H  0.584163 0.659891 -3.248907
C  -0.54302 2.36789 -2.430846
P  -0.493451 -3.942199 0.418391
C  -2.303049 -4.102395 0.352043
C  0.136897 -5.096827 -0.836532
H  1.597744 0.606533 0.768031
C  -0.006421 -4.659957 2.016006
H  -0.415668 -4.050767 2.834863
H  -0.38691 -5.688853 2.102902
H  1.09008 -4.669483 2.097529
H  -2.757135 -3.490747 1.14503
H  -2.596707 -5.153898 0.490582
H  -2.671003 -3.746727 -0.621226
H  -0.184189 -4.768149 -1.835531
H  -0.245752 -6.111054 -0.64671
H  1.235956 -5.110967 -0.806107
H  2.128628 2.082569 -2.333688
H  -0.530319 2.800691 -3.442319
H  -1.566974 2.448836 -2.045252
C  -0.090716 4.086074 -0.537398
C  -1.236338 4.831838 -0.858206
C  0.566262 4.323567 0.677014
C  -1.694365 5.809567 0.022003
H  -1.75967 4.6679 -1.802228
C  0.088462 5.290298 1.563964
H  1.448586 3.750943 0.969907
C  -1.045712 6.041618 1.231722
H  -2.576764 6.400705 -0.235533
H  -1.41623 6.801159 1.926802
O  0.755767 5.45811 2.722122
H  0.33867 6.157949 3.244064
totalener: -1135.65703506159753 hartree
nucrepener: 1483.46445765158683 hartree
electener: -2619.04275780713215 hartree
oneelecener: -4531.30177096747320 hartree
twoeener: 1912.25901316034106 hartree
cpcmener: -0.07271615123239 hartree
kineticenergy: 1036.77302700521568 hartree
temp: 298.15 k
press: 1.00 atm
thermalcorrenthalpy: 0.00094421 hartree
totalenthalpy: -1135.33291919 hartree
totalentropycorr: -0.06811879 hartree
gibbsenthalpy: -1135.40103798 hartree
gibbsminuselec: 0.27284519 hartree
energy: -2100.7991 -524.6171 -282.6666 -282.2198 -281.9040 -281.2173 -281.0509 -281.0035 -280.8584 -280.8359 -280.6266 -280.5094 -280.5008 -280.4884 -280.4815 -280.4775 -280.4692 -182.8021 -132.6342 -132.6341 -132.5723 -116.5899 -67.2514 -66.7647 -66.7589 -32.1392 -27.4217 -26.5863 -24.8916 -24.7475 -23.9599 -23.5555 -23.2289 -22.2966 -22.2899 -21.4746 -20.4824 -19.6618 -18.8430 -18.3723 -17.9271 -17.0596 -16.7951 -16.4411 -16.1446 -16.0061 -15.5333 -15.2518 -14.9093 -14.9064 -14.8142 -14.6178 -14.5437 -14.1623 -14.0455 -14.0347 -13.8073 -13.6708 -13.5603 -13.2830 -13.2377 -12.7229 -12.6101 -12.5237 -12.4333 -12.1430 -11.9829 -11.6203 -11.4541 -11.3409 -11.3344 -10.4202 -10.2828 -9.9768 -9.1568 -8.7581 -0.8006 0.6668 1.0502 1.3355 1.7207 2.4029 2.7453 3.1457 3.4580 4.0176 4.1151 electronvolt
chargesum: 1.0000000
charge: 0.063015 -0.313489 -0.052041 -0.156927 -0.038125 0.095002 0.095895 0.108461 0.098189 0.091569 0.102730 -0.175921 -0.175853 0.144011 -0.174253 0.104190 0.093663 0.104148 0.104599 0.094369 0.103155 0.102997 0.094334 0.104621 0.120910 0.086652 0.078263 0.054175 -0.070304 -0.104741 -0.027870 0.047235 0.154621 0.035110 -0.093290 0.054545 0.047665 -0.220732 0.219421
charge: -0.220773 -0.162030 0.144685 0.055355 -0.000894 0.049206 -0.015099 0.073726 0.063142 -0.013553 0.755058 -0.183693 -0.183456 0.099684 -0.182766 0.055472 0.047708 0.055554 0.055386 0.047833 0.054904 0.054840 0.047763 0.055417 0.064971 0.061401 0.049392 -0.035290 -0.047916 -0.051518 -0.016880 0.044433 0.048467 0.045885 -0.069732 0.048370 0.049196 -0.059064 0.114818
qa: 0.0630 -0.3135 -0.0520 -0.1569 -0.0381 0.0950 0.0959 0.1085 0.0982 0.0916 0.1027 -0.1759 -0.1759 0.1440 -0.1743 0.1042 0.0937 0.1041 0.1046 0.0944 0.1032 0.1030 0.0943 0.1046 0.1209 0.0867 0.0783 0.0542 -0.0703 -0.1047 -0.0279 0.0472 0.1546 0.0351 -0.0933 0.0545 0.0477 -0.2207 0.2194
va: 1.5748 3.8883 3.9252 4.0188 3.8992 0.9843 3.9116 0.9849 0.9758 3.9381 4.1755 3.8949 3.8947 0.9739 3.8955 0.9846 0.9893 0.9847 0.9843 0.9893 0.9847 0.9847 0.9892 0.9843 0.9753 0.9825 0.9832 3.8065 3.8487 3.8424 3.8703 0.9913 4.0269 1.0078 3.8021 0.9836 0.9944 2.2305 0.9886
dispcorr: -0.016889616 hartree
energy: -1135.679115354445
zeropoint: 0.32155351 hartree
thermalvibcorrection: 0.01838893 hartree
thermalrotcorrection: 0.00141627 hartree
thermaltrasncorrection: 0.00141627 hartree
thermaltotal: -1135.33634038 hartree
thermalcorr: 0.02122147 hartree
nonthermalcorr: 0.32155351 hartree
totalcorr: 0.34277498 hartree
totalenthalpy: -1135.33539617 hartree
