program: Gaussian 09
title: 000066237
version: EM64L-G09RevD.01
frameworkgroup: C1[X(C23H32O2)]
method: RPBEPBE
basis: SDD
operation: Freq
keyword: #pfreq=noraman
keyword: PBEPBE/SDD
title: #p freq=noraman PBEPBE/SDD
converged: YES YES NO NO
title: Mulliken charges:
elementType: O O C C C C C C C C C C C C C C C C C C C C C C C H H H H H H H H H H H H H H H H H H H H H H H H H H H H H H H H
charge: -0.455224 -0.455077 -0.011578 0.499880 0.499666 0.161466 0.161588 0.351069 0.351411 -0.760414 -0.759634 -0.582433 -0.582334 -0.439766 -0.440042 0.138456 0.138116 -0.754988 -0.730690 -0.730566 -0.755228 -0.730525 -0.730635 -0.441212 -0.440664 0.234152 0.207079 0.231191 0.206903 0.230894 0.234143 0.270257 0.270706 0.247166 0.246679 0.218798 0.213723 0.221796 0.209301 0.201210 0.262796 0.201435 0.210182 0.262336 0.221951 0.213701 0.218760 0.209412 0.201207 0.262465 0.262415 0.210205 0.201399 0.207004 0.206920 0.351593 0.351582
chargesum: 0.00000
title: Mulliken charges with hydrogens summed into heavy atoms:
elementType: O O C C C C C C C C C C C C C C C C C C C C C C C
charge: -0.103631 -0.103495 -0.011578 0.499880 0.499666 0.161466 0.161588 0.351069 0.351411 -0.087992 -0.087694 -0.312176 -0.311628 -0.192600 -0.193363 0.138456 0.138116 -0.100671 -0.057383 -0.056614 -0.100815 -0.057441 -0.056616 -0.234208 -0.233744
polarizability: 2.79322059e+02 2.66006787e-01 2.48551721e+02 -2.45843139e+01 -1.75961834e-01 2.38467815e+02
1716.lowfreq: -4.2499 -0.0006 0.0001 0.0002 8.9281 15.0234 15.5916 22.8846 32.6906
frequency: 15.3007 22.1527 32.6505 62.2838 72.2187 107.6476 112.1061 115.3864 140.6535 143.6907 193.5987 204.5121 210.1642 231.4388 233.8077 250.3928 252.1581 257.4429 260.9777 262.2773 270.7211 287.1266 307.4490 313.8948 315.5304 319.5112 322.9116 335.7704 336.4630 347.3711 352.2996 360.5764 366.1127 378.6577 389.8304 391.1885 392.6871 395.2706 450.8543 472.4986 480.2331 493.7782 494.1395 504.2093 556.3947 559.4620 569.9893 639.4742 643.5754 659.9264 693.9762 707.8305 745.4968 748.5418 753.5025 801.7780 802.5790 803.6255 808.6326 863.3369 894.0703 914.0480 914.4118 921.9011 922.1251 929.8534 932.5805 933.4371 937.3397 938.5297 947.8076 951.0393 951.5748 1002.4081 1020.7709 1021.6086 1032.7836 1033.2973 1068.4908 1071.3125 1093.5733 1126.5487 1134.9617 1145.8901 1159.2293 1176.0247 1177.8789 1203.3163 1203.6265 1215.8473 1216.3474 1220.3509 1232.4247 1234.9545 1242.1333 1274.7825 1278.9216 1314.8892 1316.4173 1371.1440 1372.2633 1372.5366 1372.9245 1373.5717 1377.6772 1383.1609 1393.4898 1394.3476 1396.6095 1403.4145 1406.0181 1456.2522 1456.5019 1465.8259 1469.8488 1470.9154 1473.9117 1475.9941 1476.2370 1477.8733 1478.0223 1486.4889 1486.7881 1489.2167 1489.6865 1501.3074 1501.4980 1506.7087 1506.8734 1592.9350 1597.2348 1612.0580 1612.6123 2970.7074 2970.7132 2973.9399 2974.1200 2975.2538 2978.2692 2978.3395 2978.6625 3060.3023 3060.3612 3063.2751 3063.3366 3069.1696 3069.6332 3069.8445 3072.1137 3072.5642 3072.6721 3082.7494 3084.3483 3098.7293 3099.0723 3104.3150 3105.4289 3107.5694 3108.0751 3150.4069 3150.7624 3155.4160 3156.5535 3570.8064 3570.9146
redmass: 3.7907 3.9123 4.3340 3.0444 3.2837 3.9059 4.0726 3.4092 3.7749 3.4790 2.2398 1.1045 1.3204 2.1346 2.2086 1.2294 1.2045 2.7397 2.9945 1.7705 3.1672 1.7165 1.0972 2.6349 2.4727 2.8838 2.9113 1.0877 1.0877 1.4769 1.1954 2.0397 2.9575 3.1910 2.5838 2.7139 2.7574 2.8586 3.7112 3.3971 3.2198 3.0474 3.1600 3.4059 3.1724 3.1587 4.1790 6.1460 3.8227 3.9825 5.2974 5.5831 3.7918 3.8374 3.3985 1.5528 1.8539 2.5715 2.8972 3.2453 3.0383 1.5709 1.5695 1.6761 1.6519 1.3811 1.6742 1.6758 1.3822 1.3955 2.1379 1.2123 1.2116 1.3042 1.4570 1.4445 1.3821 1.3812 2.7543 2.6713 1.9652 2.2655 2.5787 1.5634 2.0739 1.2459 1.2414 2.9296 2.9420 2.6598 2.7052 2.9567 2.8542 2.3082 2.1476 3.3068 3.6072 1.4242 1.3401 1.1870 1.2127 1.5266 1.2420 1.2848 2.4823 4.3285 1.2791 1.9396 1.5367 1.6379 1.9783 1.0482 1.0482 1.0619 1.1513 1.1319 1.0559 1.0482 1.0478 1.0563 1.0546 1.0504 1.0704 1.0523 1.0514 2.1420 2.0446 1.0903 1.0822 6.3203 6.4889 6.2341 6.2532 1.0352 1.0352 1.0363 1.0363 1.0348 1.0365 1.0370 1.0361 1.1001 1.1001 1.0993 1.0993 1.0996 1.0996 1.0993 1.0991 1.0988 1.0986 1.0996 1.0994 1.0891 1.0891 1.0983 1.0982 1.0976 1.0976 1.0893 1.0897 1.0933 1.0934 1.0658 1.0658
irintensity: 0.0482 0.0805 0.2216 0.4638 0.0269 0.0135 0.6928 1.2304 1.0416 0.3688 0.6025 0.1378 0.0172 1.0184 0.0529 0.1907 0.0893 0.0583 0.7607 0.3910 1.3787 0.0692 0.8422 5.3206 5.5356 2.3871 10.3856 6.5631 5.8378 79.7106 69.0883 38.7800 6.2279 0.3085 0.6400 7.8149 0.3167 1.9011 3.0779 0.2507 6.7481 6.0169 11.1426 4.8708 8.1964 0.8060 5.9597 5.3215 13.9199 4.3322 3.7280 2.9213 10.8893 0.4263 14.7350 54.1883 8.0626 28.6909 1.4816 0.0095 8.4725 2.2558 2.2599 0.6801 2.9528 0.0474 2.5248 3.8559 7.1677 13.0344 9.8317 0.3180 0.3034 1.6140 2.5008 1.0291 0.7460 0.7217 181.0629 16.5123 17.3344 1.8346 39.2313 62.3668 167.9243 38.7180 13.2234 6.3647 6.4565 3.2914 0.5734 44.2230 61.3284 10.0345 26.8900 0.9413 53.8268 28.7695 19.8669 24.0199 19.9016 4.1878 30.0824 2.5840 102.2033 6.1102 27.8628 8.7859 6.8568 25.4049 2.3601 0.1809 0.2878 3.2162 25.9685 11.7963 3.4701 0.3486 0.0320 15.7651 7.0897 19.2845 7.2383 11.6249 6.3443 44.6458 72.9641 12.6393 13.2115 0.3948 1.1754 8.9632 0.1725 31.5757 8.8052 44.0319 39.7964 23.2865 72.0170 58.3742 1.0626 9.6715 8.7907 11.9268 10.8630 24.5542 74.3015 1.6868 177.6696 23.8166 82.1337 37.0286 38.5773 29.1670 17.2234 2.5167 1.1292 18.8265 23.6891 1.1501 17.3366 9.4845 10.4905 49.2946 7.4212
temp: 298.150 k
press: 1.00000 atm
elementType: 8 8 6 6 6 6 6 6 6 6 6 6 6 6 6 6 6 6 6 6 6 6 6 6 6 1 1 1 1 1 1 1 1 1 1 1 1 1 1 1 1 1 1 1 1 1 1 1 1 1 1 1 1 1 1 1 1
symmnumber: 1
zpe: 1283867.9 jmol-1
zpe.correction: 0.488999 hartree
zpe.thermalcorrener: 0.515934 hartree
zpe.thermalcorrenthalpy: 0.516879 hartree
zpe.thermalcorrgfe: 0.433881 hartree
zpe.sumelectzpe: -1044.195553 hartree
zpe.sumelectthermal: -1044.168618 hartree
zpe.sumelectthermalent: -1044.167674 hartree
zpe.sumelectthermalfe: -1044.250672 hartree
dipole: 0.0139 1.5844 0.0156
dipole: 1.5845
quadrupole: -148.4229 -153.0966 -138.1425
quadrupole: 0.1514 -16.9302 -0.0954
quadrupole: -1.8689 -6.5426 8.4115 0.1514 -16.9302 -0.0954
hfenergy: -1044.6845528 hartree
pointgroup: C01 [X(C23H32O2)]
dipole: -0.0071394 0.6230458 -0.0197701 debye
polarizability: 276.7160592|-0.7877259|248.552854|-26.5242314|-0.0360432|241.0726823 unknown
InChI: InChI=1S/C23H32O2/c1-21(2,3)17-13-15(9-11-19(17)24)23(7,8)16-10-12-20(25)18(14-16)22(4,5)6/h9-14,24-25H,1-8H3
charge 0 multiplicity 1
57 atoms
O  4.457766 -0.934235 -1.6545
O  -4.477592 -0.867873 1.686562
C  -0.013866 2.407759 -0.060389
C  1.151894 1.511797 -0.550326
C  -1.175418 1.531583 0.474022
C  3.222363 -1.462211 0.95356
C  -3.214784 -1.535899 -0.876157
C  2.734693 -0.355718 -0.01295
C  -2.742322 -0.373759 0.030484
C  -0.589389 3.296125 -1.203993
C  0.554677 3.357838 1.035977
C  1.643157 0.486753 0.302899
C  -1.653175 0.456578 -0.323267
C  1.797297 1.696896 -1.792436
C  -1.832477 1.782558 1.69846
C  3.356927 -0.125307 -1.278817
C  -3.377522 -0.075519 1.275488
C  2.380153 -1.511357 2.255568
C  4.705621 -1.193504 1.354842
C  3.107101 -2.855109 0.260646
C  -2.357256 -1.655771 -2.16369
C  -4.694735 -1.298238 -1.307371
C  -3.101096 -2.886636 -0.104027
C  2.892108 0.881032 -2.151303
C  -2.925673 0.981311 2.093536
H  -1.450149 3.874096 -0.823725
H  0.163408 4.015635 -1.576592
H  -0.943778 2.685446 -2.053629
H  -0.203402 4.091239 1.368277
H  0.910175 2.794796 1.917471
H  1.412885 3.920231 0.627696
H  1.126604 0.33366 1.255134
H  -1.128248 0.25333 -1.261394
H  1.460812 2.466053 -2.493707
H  -1.506776 2.592211 2.358248
H  2.769192 -2.316832 2.905203
H  2.441448 -0.564743 2.824189
H  1.315417 -1.730316 2.052251
H  4.797495 -0.224624 1.880482
H  5.058756 -1.989828 2.037402
H  5.360998 -1.175517 0.46974
H  3.463188 -3.645182 0.94894
H  2.054835 -3.075598 0.000366
H  3.7120 -2.894199 -0.659038
H  -1.293782 -1.855697 -1.935723
H  -2.416523 -0.74503 -2.78846
H  -2.734116 -2.500544 -2.769117
H  -4.786807 -0.359551 -1.885113
H  -5.036195 -2.132417 -1.949424
H  -5.359399 -1.236681 -0.431108
H  -3.715039 -2.876624 0.810503
H  -2.050696 -3.087031 0.178889
H  -3.447176 -3.716169 -0.749761
H  3.387867 1.029816 -3.121027
H  -3.430494 1.181723 3.049232
H  4.783834 -0.664888 -2.549187
H  -4.815183 -0.54786 2.56006
