program: Orca
programVersion: 6.0.x
elementType: Au C C C C H C H H C P C C H C H H H H H H H H H H H H C C C C H C H C H H N C C H H C H H C H H H H
elementType: Au
charge: 1
multiplicity: 1
keywords: wB97X-D3 def2-TZVPPD autoaux TightSCF
formula: C19H28AuNP
InChI: InChI=1/C16H19N.C3H9P.Au/c1-3-4-7-14(2)15-8-10-16(11-9-15)17-12-5-6-13-17;1-4(2)3;/h1,8-11H,2,4-7,12-13H2;1-3H3;/rC19H28AuNP/c1-17(9-5-6-14-20-22(2,3)4)18-10-12-19(13-11-18)21-15-7-8-16-21/h10-14H,1,5,7-9,15-16H2,2-4H3
50 atoms
Au 0.378217 -3.126818 0.087577
C  1.011506 -1.295835 -0.721314
C  0.118273 -0.758491 -1.451918
C  -0.307717 1.68253 -1.952492
C  0.775551 1.096813 -2.546615
H  1.780486 1.513383 -2.441865
C  -1.212055 -0.599864 -2.077077
H  -1.923085 -1.26647 -1.565751
H  -1.156504 -0.920393 -3.128445
C  -1.589953 0.877131 -1.938245
P  -0.231511 -5.168349 1.00831
C  -0.926623 -5.033426 2.682457
C  -1.491046 -6.048894 0.036988
H  2.021121 -0.938347 -0.503449
C  1.158532 -6.329773 1.159446
H  1.925611 -5.903094 1.821818
H  0.808904 -7.286463 1.57592
H  1.604356 -6.504191 0.169558
H  -0.18471 -4.580316 3.355727
H  -1.200946 -6.029856 3.060506
H  -1.821407 -4.394519 2.661961
H  -2.402671 -5.437194 -0.025608
H  -1.731369 -7.012036 0.512067
H  -1.115091 -6.228394 -0.980623
H  0.667709 0.335281 -3.322922
H  -2.285892 1.206485 -2.725584
H  -2.103576 1.024135 -0.979738
C  -0.240522 2.97514 -1.265016
C  -1.215057 3.393015 -0.335945
C  0.807306 3.884292 -1.528593
C  -1.14699 4.618146 0.303925
H  -2.052287 2.739101 -0.083697
C  0.894826 5.11271 -0.90303
H  1.567826 3.632391 -2.271714
C  -0.083053 5.519828 0.043781
H  -1.921195 4.879834 1.026286
H  1.716875 5.781218 -1.162366
N  -0.006843 6.720716 0.665639
C  1.111206 7.646783 0.513587
C  -1.034749 7.233385 1.566204
H  2.075576 7.124231 0.615841
H  1.095426 8.122925 -0.48465
C  0.881561 8.668579 1.62566
H  -2.038103 7.126047 1.123995
H  -1.031995 6.67808 2.522786
C  -0.640285 8.696034 1.763834
H  1.33967 8.310233 2.561746
H  1.31845 9.649065 1.390132
H  -1.08208 9.313013 0.96474
H  -0.987104 9.095426 2.72717
totalener: -1272.69228093828792 hartree
nucrepener: 1929.83716088217011 hartree
electener: -3202.45206618545126 hartree
oneelecener: -5602.54693716281963 hartree
twoeener: 2400.09487097736837 hartree
cpcmener: -0.06745360977455 hartree
kineticenergy: 1177.25522462784261 hartree
energy: -2100.7663 -393.2166 -282.1658 -281.3778 -281.1598 -280.7913 -280.5905 -280.5890 -280.3975 -280.3293 -280.2179 -280.1928 -280.1069 -280.0422 -280.0327 -280.0324 -280.0314 -279.8561 -279.8352 -279.7191 -279.7136 -182.4558 -132.1562 -132.1558 -132.0991 -116.5761 -67.1755 -66.7855 -66.7776 -29.6224 -27.1786 -26.5286 -25.3179 -24.7701 -24.5739 -23.9339 -23.6726 -23.2246 -22.7111 -22.4305 -22.4241 -21.5111 -20.5105 -19.9032 -18.9013 -18.7977 -18.3597 -18.0994 -17.7337 -17.3502 -16.7442 -16.5659 -16.0444 -15.8332 -15.4810 -15.2799 -15.0253 -14.8529 -14.8497 -14.5699 -14.3964 -14.3868 -14.2343 -14.0852 -14.0126 -14.0042 -13.8258 -13.8095 -13.5330 -13.4868 -13.2347 -13.1079 -12.8455 -12.5840 -12.4764 -12.4033 -12.0786 -12.0179 -11.9484 -11.7072 -11.5238 -11.4506 -11.3727 -11.3608 -11.3163 -10.8639 -10.2367 -9.9390 -9.6989 -9.3943 -7.4972 -0.6817 0.7310 1.0200 1.1601 1.4300 1.5527 1.6982 1.8883 2.0844 2.2080 2.2557 electronvolt
chargesum: 1.0000000
charge: -0.123514 -0.176523 -0.378529 0.752955 -0.915486 0.231148 0.079974 0.233150 0.174495 -0.276394 0.568606 -0.769077 -0.769809 0.344800 -0.766349 0.253923 0.270281 0.247226 0.248786 0.270355 0.249819 0.259995 0.275824 0.247464 0.310933 0.237726 0.218252 0.721580 -0.954839 -0.839919 -0.532367 0.043018 -0.411661 0.075544 1.436402 0.169015 0.180286 -0.062067 -0.583183 -0.592633 0.224482 0.263848 -0.464560 0.221540 0.265512 -0.427064 0.244137 0.243424 0.246833 0.232643
charge: 0.568802 -0.104812 -0.090995 -0.155062 0.190442 0.001605 -0.022707 0.037699 0.042726 0.033774 0.718041 -0.032777 -0.032386 -0.046399 -0.032108 -0.039235 -0.031075 -0.039987 -0.039549 -0.031028 -0.039960 -0.039799 -0.031123 -0.039939 0.000959 0.051168 0.019232 -0.159258 0.052394 0.047854 0.066148 0.014124 0.067509 0.019080 -0.182018 0.006495 0.007577 -0.028327 -0.006143 -0.006523 0.036211 0.045119 0.007520 0.036268 0.044986 0.007560 0.029266 0.024780 0.029189 0.024680
qa: -0.1235 -0.1765 -0.3785 0.7530 -0.9155 0.2311 0.0800 0.2332 0.1745 -0.2764 0.5686 -0.7691 -0.7698 0.3448 -0.7663 0.2539 0.2703 0.2472 0.2488 0.2704 0.2498 0.2600 0.2758 0.2475 0.3109 0.2377 0.2183 0.7216 -0.9548 -0.8399 -0.5324 0.0430 -0.4117 0.0755 1.4364 0.1690 0.1803 -0.0621 -0.5832 -0.5926 0.2245 0.2638 -0.4646 0.2215 0.2655 -0.4271 0.2441 0.2434 0.2468 0.2326
va: 1.8864 3.1593 3.5477 1.1716 3.4159 1.0026 3.7524 0.9788 1.0452 3.9107 3.6444 4.0008 3.9517 0.8752 3.9635 1.0473 1.0572 1.0587 1.0597 1.0559 1.0603 1.0450 1.0547 1.0645 0.9315 0.9277 0.9607 -0.6348 2.6283 2.0806 2.9398 1.0331 2.8546 1.0042 1.0886 0.9228 0.9035 2.8625 4.1025 4.1785 1.0353 0.9988 3.9340 1.0401 0.9923 3.9582 0.9899 1.0468 0.9937 1.0641
dispcorr: -0.021512329 hartree
energy: -1272.713793266899
