program: Orca
programVersion: 6.0.x
elementType: Au C C C C H C H H C P C C H C H H H H H H H H H H H H C C C C H C H C H H Cl
elementType: Au
charge: 1
multiplicity: 1
keywords: wB97X-D3 def2-TZVPPD autoaux TightSCF
formula: C15H20ClAuP
InChI: InChI=1/C12H11Cl.C3H9P.Au/c1-3-4-5-10(2)11-6-8-12(13)9-7-11;1-4(2)3;/h1,6-9H,2,4-5H2;1-3H3;/rC15H20AuClP/c1-13(14-8-10-15(17)11-9-14)7-5-6-12-16-18(2,3)4/h8-12H,1,5,7H2,2-4H3
38 atoms
Au 0.340992 -2.113205 0.016707
C  1.048254 -0.234679 -0.577099
C  0.343902 0.317948 -1.490804
C  0.057947 2.610877 -1.873219
C  1.223411 2.095681 -2.358794
H  2.196772 2.44521 -2.006046
C  -0.847331 0.433764 -2.37193
H  -1.638799 -0.237879 -2.007686
H  -0.582362 0.118845 -3.392216
C  -1.224363 1.920043 -2.298417
P  -0.392117 -4.190285 0.754961
C  -2.14779 -4.205598 1.227253
C  -0.217437 -5.508325 -0.484754
H  1.952095 0.172229 -0.114468
C  0.505529 -4.783013 2.220219
H  0.384323 -4.062022 3.041638
H  0.117186 -5.762988 2.536066
H  1.576001 -4.874204 1.985918
H  -2.320709 -3.473298 2.029142
H  -2.4399 -5.206736 1.578547
H  -2.76575 -3.930597 0.360201
H  -0.799764 -5.250271 -1.381175
H  -0.581472 -6.463825 -0.077769
H  0.839867 -5.612019 -0.76824
H  1.244018 1.478053 -3.260409
H  -1.607905 2.308793 -3.253694
H  -2.001105 2.075672 -1.539141
C  0.015456 3.689464 -0.862322
C  -1.142389 4.469984 -0.723047
C  1.115354 3.970005 -0.034857
C  -1.199607 5.513902 0.194882
H  -2.015107 4.280195 -1.351525
C  1.063735 4.995855 0.900753
H  2.024755 3.368872 -0.098958
C  -0.094727 5.766178 1.00462
H  -2.100329 6.12418 0.283188
H  1.918375 5.198233 1.549032
Cl -0.161852 7.056191 2.167642
totalener: -1520.87760882028692 hartree
nucrepener: 1571.03522057722944 hartree
electener: -3091.83167220995711 hartree
oneelecener: -5238.58978327058867 hartree
twoeener: 2146.75811106063156 hartree
cpcmener: -0.07384801066781 hartree
kineticenergy: 1425.98568288373758 hartree
energy: -2765.6538 -2100.7664 -282.2874 -282.0229 -281.6361 -280.8787 -280.8392 -280.6108 -280.5718 -280.5671 -280.5101 -280.5092 -280.5018 -280.4733 -280.0510 -280.0491 -280.0417 -260.9177 -199.7552 -199.5191 -199.5076 -182.4573 -132.1577 -132.1575 -132.1000 -116.5922 -67.1894 -66.7984 -66.7942 -28.0653 -27.4070 -26.4290 -24.9437 -24.7680 -24.2931 -23.9451 -23.2036 -22.4406 -22.4384 -21.6186 -20.1957 -20.0879 -18.5365 -18.3648 -17.8515 -17.1013 -16.4814 -16.2409 -16.0637 -15.5765 -15.4556 -15.0043 -14.8644 -14.8605 -14.8546 -14.5573 -14.3553 -14.0673 -14.0268 -14.0191 -13.7062 -13.5447 -13.4857 -13.3361 -12.6923 -12.6428 -12.5008 -12.4734 -12.3043 -11.9560 -11.5591 -11.5290 -11.4326 -11.3834 -11.3720 -10.3263 -10.1742 -10.0266 -9.9547 -8.8514 -0.8665 0.5330 0.8487 0.9983 1.1206 1.5149 1.5862 1.7101 1.8939 2.0022 2.2636 electronvolt
chargesum: 1.0000000
charge: -0.110248 -0.079365 -0.424328 0.541517 -0.512490 0.227313 0.094003 0.215337 0.158922 -0.480824 0.561754 -0.779153 -0.780962 0.358020 -0.762951 0.249680 0.272977 0.251505 0.246792 0.277506 0.254405 0.251053 0.277538 0.247472 0.286466 0.230129 0.220299 0.382515 -0.204697 -0.270430 -0.489962 0.190165 -0.579032 0.160369 0.474379 0.183952 0.172371 -0.311995
charge: 0.567576 -0.102104 -0.101231 -0.144186 0.216964 0.012789 -0.008151 0.035788 0.041949 0.038532 0.717561 -0.032845 -0.032784 -0.046275 -0.032482 -0.039910 -0.031056 -0.039697 -0.040053 -0.031055 -0.040084 -0.040109 -0.030976 -0.039810 0.020105 0.050405 0.031791 -0.130559 0.066830 0.068610 -0.010068 0.029525 -0.010877 0.024806 -0.628489 0.020224 0.019930 0.649413
qa: -0.1102 -0.0794 -0.4243 0.5415 -0.5125 0.2273 0.0940 0.2153 0.1589 -0.4808 0.5618 -0.7792 -0.7810 0.3580 -0.7630 0.2497 0.2730 0.2515 0.2468 0.2775 0.2544 0.2511 0.2775 0.2475 0.2865 0.2301 0.2203 0.3825 -0.2047 -0.2704 -0.4900 0.1902 -0.5790 0.1604 0.4744 0.1840 0.1724 -0.3120
va: 1.8825 3.0756 3.7700 1.4094 3.4784 0.9602 3.8031 0.9838 1.0712 4.1873 3.6121 3.9811 3.9940 0.8641 3.9496 1.0539 1.0550 1.0498 1.0634 1.0498 1.0539 1.0540 1.0490 1.0635 0.9294 0.9569 0.9710 0.8959 2.9857 3.0896 3.5826 0.9507 3.6029 0.9505 2.7900 0.9200 0.9345 0.9485
dispcorr: -0.016973122 hartree
energy: -1520.894581942474
