program: Orca
programVersion: 6.0.x
elementType: Au C C C C H C H H C P C C H C H H H H H H H H H H H H C C C C H C H C N O O C N C N
elementType: Au
charge: 1
multiplicity: 1
keywords: wB97X-D3 def2-TZVPPD autoaux TightSCF
formula: C17H18AuN3O2P
InChI: InChI=1/C14H9N3O2.C3H9P.Au/c1-3-4-5-10(2)11-6-12(8-15)14(17(18)19)13(7-11)9-16;1-4(2)3;/h1,6-7H,2,4-5H2;1-3H3;/rC17H18AuN3O2P/c1-13(7-5-6-8-18-24(2,3)4)14-9-15(11-19)17(21(22)23)16(10-14)12-20/h8-10H,1,5,7H2,2-4H3
42 atoms
Au 0.140389 -2.778024 0.239105
C  1.052391 -0.919178 -0.037216
C  0.988166 -0.456604 -1.233974
C  1.142929 1.68854 -1.87035
C  2.348629 1.097045 -1.63163
H  2.995853 1.426908 -0.814682
C  0.43267 -0.456636 -2.617819
H  -0.501522 -1.035722 -2.645386
H  1.147592 -0.926929 -3.309415
C  0.238637 1.041356 -2.901443
P  -0.842185 -4.85404 0.602278
C  -2.471118 -4.754571 1.402811
C  -1.117535 -5.790446 -0.931635
H  1.573698 -0.443864 0.799521
C  0.152878 -5.945608 1.661824
H  0.29242 -5.476706 2.646654
H  -0.350921 -6.915703 1.788313
H  1.139749 -6.104639 1.203588
H  -2.371359 -4.270857 2.385324
H  -2.893968 -5.762025 1.533907
H  -3.150068 -4.152983 0.781378
H  -1.775051 -5.21588 -1.599933
H  -1.584147 -6.761571 -0.707857
H  -0.156484 -5.956248 -1.439643
H  2.806366 0.420531 -2.358026
H  0.509035 1.325952 -3.928727
H  -0.804513 1.335434 -2.728837
C  0.658158 2.833451 -1.063374
C  -0.185916 3.78054 -1.649629
C  1.03451 2.99389 0.273121
C  -0.63714 4.886532 -0.923025
H  -0.493768 3.683743 -2.692271
C  0.591303 4.091268 1.01504
H  1.667535 2.255082 0.766928
C  -0.24222 5.037335 0.40917
N  -0.706014 6.198931 1.181122
O  0.070912 6.68145 1.970042
O  -1.829667 6.588533 0.970648
C  -1.476569 5.840624 -1.603898
N  -2.129124 6.561431 -2.227537
C  0.993403 4.175161 2.397196
N  1.344145 4.15542 3.497619
totalener: -1450.26606961834500 hartree
nucrepener: 2152.10896532249308 hartree
electener: -3602.26086497668848 hartree
oneelecener: -6284.76059671782696 hartree
twoeener: 2682.49973174113848 hartree
cpcmener: -0.11279238995484 hartree
kineticenergy: 1354.56445949416798 hartree
energy: -2100.7850 -525.3183 -525.3175 -400.2464 -393.4000 -393.3887 -283.1604 -282.5903 -282.5898 -282.4368 -282.1263 -281.8682 -281.8650 -281.8554 -281.7272 -281.7171 -281.1575 -280.9936 -280.7529 -280.6204 -280.0753 -280.0665 -280.0647 -182.4771 -132.1776 -132.1770 -132.1196 -116.6374 -67.2339 -66.8405 -66.8401 -38.2341 -33.3423 -29.3671 -28.8432 -28.5213 -27.8225 -26.4884 -26.0785 -24.9663 -24.7896 -24.1804 -23.5438 -22.4635 -22.4593 -22.3028 -21.6199 -21.2826 -20.2816 -19.2030 -19.0156 -18.4504 -18.2765 -18.2273 -17.6021 -17.4559 -17.2524 -17.1217 -16.3169 -16.1219 -15.5300 -15.4136 -15.1139 -14.8891 -14.8801 -14.8230 -14.4209 -14.3843 -14.0484 -14.0449 -13.9331 -13.8566 -13.8194 -13.7059 -13.5668 -13.4299 -13.3436 -13.0883 -12.8861 -12.8309 -12.6275 -12.5004 -12.2225 -12.0965 -12.0001 -11.9458 -11.8407 -11.4892 -11.4268 -11.4128 -10.9690 -10.6404 -10.3950 -9.9919 -9.5121 -1.7730 -0.7640 -0.5352 0.3771 0.5641 1.0647 1.1905 1.4685 1.6389 1.8534 1.9688 electronvolt
chargesum: 1.0000000
charge: -0.132146 -0.048869 -0.425206 0.602752 -0.376871 0.213120 0.050469 0.218035 0.163520 -0.548882 0.511462 -0.772034 -0.772763 0.382770 -0.763318 0.253639 0.272770 0.246634 0.250235 0.276946 0.249427 0.254015 0.277030 0.249081 0.257851 0.195786 0.259905 0.918714 -0.318542 -0.225125 0.519225 0.197344 0.193258 0.190967 0.176949 1.060468 -0.618603 -0.622747 -0.375631 -0.510211 -0.410974 -0.520451
charge: 0.567618 -0.095627 -0.112010 -0.135882 0.240451 0.028405 0.002951 0.036679 0.043488 0.051890 0.717912 -0.032728 -0.032884 -0.046858 -0.032051 -0.039477 -0.030914 -0.039993 -0.039488 -0.030873 -0.040417 -0.040357 -0.030972 -0.040108 0.032763 0.051862 0.039351 -0.072870 0.154044 0.154164 -0.088647 0.056660 -0.088710 0.047441 -0.022461 -0.325682 0.097486 0.097470 -0.147858 0.147311 -0.148000 0.146918
qa: -0.1321 -0.0489 -0.4252 0.6028 -0.3769 0.2131 0.0505 0.2180 0.1635 -0.5489 0.5115 -0.7720 -0.7728 0.3828 -0.7633 0.2536 0.2728 0.2466 0.2502 0.2769 0.2494 0.2540 0.2770 0.2491 0.2579 0.1958 0.2599 0.9187 -0.3185 -0.2251 0.5192 0.1973 0.1933 0.1910 0.1769 1.0605 -0.6186 -0.6227 -0.3756 -0.5102 -0.4110 -0.5205
va: 1.8770 2.9662 3.7981 1.5875 3.5602 0.9822 3.7953 0.9773 1.0531 4.3556 3.6267 3.9964 3.9507 0.7877 3.9709 1.0444 1.0532 1.0589 1.0582 1.0467 1.0605 1.0548 1.0517 1.0599 0.9506 0.9956 0.9520 -0.3873 2.3438 2.3116 2.5865 0.9688 2.3028 0.8697 3.7484 3.4308 1.5235 1.5192 1.8731 1.9401 1.8135 1.9131
dispcorr: -0.020563754 hartree
energy: -1450.286633371929
