program: Orca
programVersion: 6.0.x
elementType: Au C C C C H C H H C P C C H C H H H H H H H H H H H H C C C C H C H C H H N C C H H H H H H
elementType: Au
charge: 1
multiplicity: 1
keywords: wB97X-D3 def2-TZVPPD autoaux TightSCF
formula: C17H26AuNP
InChI: InChI=1/C14H17N.C3H9P.Au/c1-5-6-7-12(2)13-8-10-14(11-9-13)15(3)4;1-4(2)3;/h1,8-11H,2,6-7H2,3-4H3;1-3H3;/rC17H26AuNP/c1-15(9-7-8-14-18-20(4,5)6)16-10-12-17(13-11-16)19(2)3/h10-14H,1,7,9H2,2-6H3
46 atoms
Au 0.348417 -2.569037 -0.046703
C  0.875183 -0.684706 -0.806797
C  -0.099939 -0.105979 -1.385674
C  -0.540222 2.338247 -1.680534
C  0.440236 1.793733 -2.461594
H  1.460343 2.186471 -2.450292
C  -1.500028 0.086043 -1.823148
H  -2.145409 -0.597176 -1.250452
H  -1.585115 -0.188356 -2.885385
C  -1.834732 1.560366 -1.575208
P  -0.131071 -4.668101 0.820371
C  -1.837606 -4.831853 1.42471
C  0.081985 -6.008584 -0.388826
H  1.905095 -0.33575 -0.696254
C  0.920978 -5.120826 2.23166
H  0.787496 -4.387568 3.040169
H  0.651053 -6.122225 2.599288
H  1.976348 -5.118325 1.923009
H  -2.021798 -4.089093 2.214352
H  -2.001814 -5.842131 1.828982
H  -2.541682 -4.650815 0.599727
H  -0.590446 -5.844199 -1.243103
H  -0.14836 -6.979501 0.075193
H  1.119525 -6.016272 -0.752848
H  0.21542 1.097017 -3.273278
H  -2.588002 1.941064 -2.28263
H  -2.259959 1.674549 -0.57038
C  -0.340732 3.561006 -0.89602
C  -1.09197 3.858591 0.257633
C  0.621484 4.516279 -1.284315
C  -0.891919 5.017385 0.988483
H  -1.847977 3.15778 0.618001
C  0.833388 5.682621 -0.57345
H  1.207732 4.351699 -2.191977
C  0.081003 5.973328 0.59621
H  -1.499196 5.182511 1.878393
H  1.582448 6.386337 -0.936296
N  0.280329 7.119902 1.303909
C  -0.509223 7.393467 2.487194
C  1.280702 8.076106 0.875644
H  -0.198519 8.355417 2.910482
H  -1.587028 7.456192 2.258975
H  -0.368327 6.622298 3.2638
H  1.28215 8.929441 1.563577
H  2.294401 7.640177 0.875974
H  1.075121 8.46143 -0.137579
totalener: -1195.25440742920250 hartree
nucrepener: 1706.28108420319336 hartree
electener: -2901.45989836961917 hartree
oneelecener: -5053.65458557366037 hartree
twoeener: 2152.19468720404120 hartree
cpcmener: -0.06828843433838 hartree
kineticenergy: 1100.25098959442153 hartree
energy: -2100.7657 -393.3429 -282.1803 -281.3669 -281.1745 -280.7972 -280.4558 -280.4539 -280.4036 -280.3368 -280.2258 -280.1958 -280.1255 -280.0734 -280.0430 -280.0352 -280.0341 -279.8626 -279.8526 -182.4559 -132.1562 -132.1557 -132.0992 -116.5811 -67.1803 -66.7902 -66.7824 -29.4504 -27.1736 -26.4255 -24.9352 -24.7628 -23.9671 -23.8508 -23.1873 -22.8185 -22.4322 -22.4278 -21.6492 -21.1385 -19.5819 -19.2148 -18.3634 -18.1522 -17.6441 -17.1474 -16.6497 -16.2138 -16.0358 -15.6403 -15.4901 -15.3691 -15.1200 -14.8581 -14.8483 -14.6289 -14.4105 -14.3608 -14.0207 -14.0077 -13.9240 -13.8973 -13.7058 -13.5348 -13.4818 -13.2923 -13.2228 -13.0116 -12.8238 -12.5865 -12.4761 -12.3569 -11.9480 -11.7306 -11.4501 -11.3750 -11.3746 -11.3222 -10.9026 -10.2430 -9.9419 -9.6995 -9.4162 -7.5751 -0.6654 0.7091 1.0324 1.1589 1.4128 1.5492 1.6922 1.9004 2.1023 2.2202 2.3177 electronvolt
chargesum: 1.0000000
charge: -0.119212 -0.167616 -0.367246 0.676607 -0.903410 0.243405 0.055132 0.252772 0.161027 -0.234956 0.570038 -0.774558 -0.775243 0.341197 -0.759804 0.248620 0.272320 0.252494 0.246207 0.273315 0.257385 0.250872 0.274154 0.251328 0.300048 0.217807 0.197779 0.622133 -0.955438 -0.737265 -0.519739 0.044498 -0.389448 0.112692 1.226912 0.154676 0.172864 0.012702 -0.621040 -0.613378 0.179276 0.223439 0.223868 0.166728 0.231276 0.224782
charge: 0.569009 -0.104596 -0.090630 -0.157642 0.191324 0.004611 -0.019807 0.037365 0.042431 0.037387 0.717911 -0.032282 -0.032800 -0.046078 -0.031968 -0.039645 -0.031145 -0.039435 -0.039943 -0.030904 -0.039793 -0.040086 -0.030985 -0.039817 0.003664 0.050378 0.017845 -0.159351 0.053347 0.047754 0.063290 0.015065 0.064481 0.021239 -0.190630 0.002325 0.002798 -0.101355 0.140918 0.140866 0.006969 0.015382 0.015011 0.007229 0.015536 0.014755
qa: -0.1192 -0.1676 -0.3672 0.6766 -0.9034 0.2434 0.0551 0.2528 0.1610 -0.2350 0.5700 -0.7746 -0.7752 0.3412 -0.7598 0.2486 0.2723 0.2525 0.2462 0.2733 0.2574 0.2509 0.2742 0.2513 0.3000 0.2178 0.1978 0.6221 -0.9554 -0.7373 -0.5197 0.0445 -0.3894 0.1127 1.2269 0.1547 0.1729 0.0127 -0.6210 -0.6134 0.1793 0.2234 0.2239 0.1667 0.2313 0.2248
va: 1.8902 3.1358 3.5556 1.3010 3.4969 1.0027 3.8459 0.9530 1.0621 3.9484 3.6376 3.9657 4.0030 0.8847 3.9527 1.0579 1.0538 1.0477 1.0662 1.0551 1.0477 1.0593 1.0510 1.0578 0.9535 0.9347 1.0003 -0.2791 2.8128 2.5413 2.8567 1.0648 2.8643 0.9736 1.8679 0.9368 0.8985 2.8170 3.8188 3.8146 0.9910 1.0004 0.9912 0.9968 0.9948 0.9873
dispcorr: -0.019375843 hartree
energy: -1195.273783272470
