program: Gaussian 09
title: 000066154
version: EM64L-G09RevD.01
frameworkgroup: C1[X(C2HClF2O2)]
method: RPBEPBE
basis: SDD
operation: Freq
keyword: #p
keyword: freq=noraman
keyword: PBEPBE/SDD
title: #p freq=noraman PBEPBE/SDD
converged: YES YES YES YES
title: Mulliken charges:
elementType: Cl F F O O C C H
charge: 0.066206 -0.117418 -0.111931 -0.374337 -0.167829 0.055841 0.242488 0.406980
chargesum: 0.00000
title: Mulliken charges with hydrogens summed into heavy atoms:
elementType: Cl F F O O C C
charge: 0.066206 -0.117418 -0.111931 0.032642 -0.167829 0.055841 0.242488
polarizability: 4.29521282e+01 4.82533007e+00 3.79206193e+01 1.01295946e+00 -1.94736782e+00 3.26476828e+01
1716.lowfreq: -17.7441 -0.0039 -0.0030 0.0016 5.4596 12.6873 43.2981 173.7893 228.4366
frequency: 43.1272 173.7880 228.4347 299.8282 344.3398 377.6340 476.5549 523.6015 570.2116 638.1979 708.9259 870.2908 1016.2700 1039.3028 1111.5403 1321.3088 1681.3637 3530.9106
redmass: 13.7246 11.0527 12.0661 17.2794 13.6602 19.2341 9.8319 4.1613 1.9672 2.9407 7.3655 11.0458 5.9795 8.8612 3.0958 2.6242 11.3424 1.0648
irintensity: 1.5470 0.3974 0.9671 0.1142 1.6938 1.7425 4.4443 17.4011 70.9781 167.4541 36.6160 205.0981 260.4820 237.4509 34.2024 21.4086 235.0482 59.7769
temp: 298.150 k
press: 1.00000 atm
elementType: 17 9 9 8 8 6 6 1
symmnumber: 1
zpe: 89454.5 jmol-1
zpe.correction: 0.034071 hartree
zpe.thermalcorrener: 0.041032 hartree
zpe.thermalcorrenthalpy: 0.041976 hartree
zpe.thermalcorrgfe: 0.001768 hartree
zpe.sumelectzpe: -886.443747 hartree
zpe.sumelectthermal: -886.436786 hartree
zpe.sumelectthermalent: -886.435842 hartree
zpe.sumelectthermalfe: -886.476051 hartree
dipole: 1.7293 -2.0633 0.2616
dipole: 2.7048
quadrupole: -40.4766 -45.4785 -48.6876
quadrupole: -4.8988 3.2580 2.3560
quadrupole: 4.4043 -0.5976 -3.8067 -4.8988 3.2580 2.3560
hfenergy: -886.4778186 hartree
pointgroup: C01 [X(C2H1Cl1F2O2)]
dipole: -0.8358898 0.5889929 -0.2945903 debye
dipolederiv: -0.2896339 -0.0323812 0.2244859 -0.0281432 -0.1180348 0.0525986 0.1859809 0.054351 -0.6139387 -0.3646913 -0.1537088 -0.1173222 -0.0542448 -0.5579329 -0.317164 -0.0581855 -0.2624763 -0.5678611 -0.3439392 0.1861245 -0.0982558 0.0942284 -0.6373285 0.2749284 -0.0456432 0.2174804 -0.4533035 -0.4728538 0.4355766 -0.011902 0.3461416 -1.0115177 0.0713712 -0.0442119 0.1410917 -0.3914202 -0.623371 -0.2923892 0.1133115 -0.025392 -0.8055422 0.1318312 -0.0348196 0.0729307 -0.2665227 0.8500456 -0.0055761 0.0563606 -0.0735504 1.3089255 -0.0013284 -0.0880722 0.005708 1.767796 1.0591532 -0.0406199 -0.1647345 -0.1487581 1.4947867 -0.2269114 0.0912043 -0.240148 0.109045 0.1852903 -0.0970259 -0.0019435 -0.1102815 0.326644 0.0146744 -0.006253 0.0110624 0.4162051 unknown
polarizability: 39.3002644|1.4438018|36.956568|-6.1208092|-3.6716473|37.2635979 unknown
InChI: InChI=1S/C2HClF2O2/c3-2(4,5)1(6)7/h6H
charge 0 multiplicity 1
8 atoms
Cl 1.304546 0.164668 -1.597717
F  1.038146 1.048095 0.913032
F  1.08985 -1.203861 0.681388
O  -1.439435 1.187786 -0.210732
O  -1.622368 -1.111348 0.179485
C  0.595513 -0.022558 0.113928
C  -0.950772 -0.078259 0.042382
H  -2.43198 1.172077 -0.280567
