program: Orca
programVersion: 6.0.x
elementType: Au C C C C H C H H C P C C H C H H H H H H H H H H H H C C C C H C H C H H C C C H H H H H
elementType: Au
charge: 1
multiplicity: 1
keywords: wB97X-D3 def2-TZVPPD autoaux TightSCF
formula: C18H25AuP
InChI: InChI=1/C15H16.C3H9P.Au/c1-3-4-5-12(2)13-6-8-14(9-7-13)15-10-11-15;1-4(2)3;/h1,6-9,15H,2,4-5,10-11H2;1-3H3;/rC18H25AuP/c1-15(7-5-6-14-19-20(2,3)4)16-8-10-17(11-9-16)18-12-13-18/h8-11,14,18H,1,5,7,12-13H2,2-4H3
45 atoms
Au 0.308876 -2.480161 0.027981
C  1.003395 -0.640175 -0.692912
C  0.183746 -0.056986 -1.479894
C  -0.073342 2.305775 -1.890105
C  0.986868 1.697723 -2.496418
H  2.015578 2.022864 -2.325258
C  -1.1205 0.12948 -2.163308
H  -1.87809 -0.500649 -1.67386
H  -1.035222 -0.20256 -3.208928
C  -1.42149 1.62886 -2.048228
P  -0.379362 -4.530708 0.873836
C  -1.711588 -4.394744 2.103396
C  -1.016742 -5.663053 -0.397806
H  1.996644 -0.290913 -0.397139
C  0.953619 -5.443427 1.707132
H  1.343258 -4.846159 2.544157
H  0.575272 -6.403302 2.089793
H  1.771217 -5.631609 0.996319
H  -1.373907 -3.779647 2.950008
H  -1.995521 -5.393307 2.468614
H  -2.587749 -3.91348 1.645261
H  -1.88016 -5.203285 -0.90009
H  -1.326838 -6.614651 0.059709
H  -0.235051 -5.856072 -1.146752
H  0.851369 1.020528 -3.343386
H  -1.978605 2.015057 -2.91545
H  -2.032976 1.814605 -1.156268
C  0.06296 3.480995 -1.006714
C  -1.068876 4.224526 -0.631269
C  1.314089 3.914319 -0.534983
C  -0.954771 5.357787 0.165733
H  -2.061528 3.930244 -0.97851
C  1.422222 5.035381 0.276916
H  2.221361 3.362617 -0.78956
C  0.293328 5.785483 0.640699
H  -1.861786 5.913015 0.420291
H  2.407661 5.342653 0.637583
C  0.456408 6.987387 1.505449
C  -0.429398 8.199893 1.34009
C  -0.570978 7.344015 2.554844
H  1.497217 7.192726 1.771459
H  -1.21298 8.148889 0.578051
H  0.041547 9.181171 1.443066
H  -0.19925 7.725159 3.509814
H  -1.452608 6.700447 2.63305
totalener: -1177.98356144112313 hartree
nucrepener: 1676.75838863441595 hartree
electener: -2854.66186795385420 hartree
oneelecener: -4970.40495665997514 hartree
twoeener: 2115.74308870612094 hartree
cpcmener: -0.07100321006655 hartree
kineticenergy: 1083.02822197583509 hartree
energy: -2100.7591 -282.2344 -281.4782 -280.8381 -280.5638 -280.5355 -280.4371 -280.4247 -280.4030 -280.2933 -280.2768 -280.1925 -280.0722 -280.0655 -280.0433 -280.0410 -280.0353 -279.9042 -279.8948 -182.4499 -132.1502 -132.1501 -132.0927 -116.5796 -67.1772 -66.7867 -66.7814 -27.5406 -27.1177 -26.4832 -25.0260 -24.7633 -24.0315 -23.8988 -23.3119 -22.4316 -22.4307 -21.6682 -20.6479 -19.8299 -19.4383 -18.8739 -18.3714 -18.2618 -17.6673 -17.1059 -16.6990 -16.0957 -16.0228 -15.6804 -15.4724 -15.2137 -14.9370 -14.8550 -14.8525 -14.5548 -14.3775 -14.0238 -14.0171 -13.9959 -13.9334 -13.7805 -13.5368 -13.5027 -13.1645 -12.6993 -12.6076 -12.5328 -12.4679 -12.3265 -11.9945 -11.8834 -11.7775 -11.4430 -11.3735 -11.3625 -11.2461 -10.8800 -10.2631 -9.9624 -9.9375 -9.7232 -8.4869 -0.8410 0.6218 0.9151 1.1148 1.3302 1.6132 1.7162 1.9559 2.0115 2.2167 2.3088 electronvolt
chargesum: 1.0000000
charge: -0.103651 -0.092279 -0.422222 0.666823 -0.627592 0.244808 0.098723 0.222688 0.166630 -0.386390 0.551147 -0.771450 -0.782456 0.348520 -0.762660 0.250400 0.272951 0.249990 0.246461 0.278618 0.250919 0.253270 0.277852 0.247514 0.298520 0.258999 0.205458 0.461819 -0.890427 -0.544347 -0.293060 0.118548 -0.619907 0.113134 0.740531 0.131726 0.118458 0.160495 -0.462993 -0.461732 0.196729 0.191566 0.201164 0.203342 0.193362
charge: 0.567160 -0.105052 -0.098699 -0.139887 0.207536 0.006077 -0.013490 0.036434 0.042252 0.033281 0.717327 -0.033128 -0.032587 -0.046237 -0.032229 -0.039704 -0.031123 -0.039791 -0.039782 -0.031122 -0.040261 -0.040213 -0.030997 -0.039803 0.014351 0.051029 0.029030 -0.138851 0.065365 0.063022 0.059749 0.021929 0.056751 0.017812 -0.137604 0.023346 0.025503 -0.135159 0.054121 0.055008 0.042346 0.013266 0.014491 0.014219 0.014315
qa: -0.1037 -0.0923 -0.4222 0.6668 -0.6276 0.2448 0.0987 0.2227 0.1666 -0.3864 0.5511 -0.7714 -0.7825 0.3485 -0.7627 0.2504 0.2730 0.2500 0.2465 0.2786 0.2509 0.2533 0.2779 0.2475 0.2985 0.2590 0.2055 0.4618 -0.8904 -0.5443 -0.2931 0.1185 -0.6199 0.1131 0.7405 0.1317 0.1185 0.1605 -0.4630 -0.4617 0.1967 0.1916 0.2012 0.2033 0.1934
va: 1.8779 3.1209 3.7435 1.1277 3.4491 0.9407 3.8022 0.9884 1.0719 4.0457 3.6143 3.9910 3.9786 0.8770 3.9510 1.0499 1.0554 1.0549 1.0635 1.0467 1.0564 1.0517 1.0499 1.0629 0.9211 0.9086 0.9874 0.1112 2.5413 2.7195 3.0865 1.0015 2.8765 0.9896 0.9860 0.9660 1.0221 2.0363 3.8572 3.8526 0.9613 1.0236 1.0581 1.0560 1.0355
dispcorr: -0.018891155 hartree
energy: -1178.002452595795
