program: Orca
programVersion: 6.0.x
elementType: Au C C C C H C H H C P C C H C H H H H H H H H H H H H C C C C H C H C H H O H
elementType: Au
charge: 1
multiplicity: 1
keywords: wB97X-D3 def2-TZVPPD autoaux TightSCF
formula: C15H21AuOP
InChI: InChI=1/C12H12O.C3H9P.Au/c1-3-4-6-10(2)11-7-5-8-12(13)9-11;1-4(2)3;/h1,5,7-9,13H,2,4,6H2;1-3H3;/rC15H21AuOP/c1-13(14-9-7-10-15(17)12-14)8-5-6-11-16-18(2,3)4/h7,9-12,17H,1,5,8H2,2-4H3
39 atoms
Au 0.261927 -1.763921 0.13459
C  0.983176 0.19296 -0.036833
C  0.663286 0.775979 -1.129415
C  0.417672 3.076164 -1.494019
C  1.709575 2.641205 -1.492829
H  2.434925 3.005388 -0.76121
C  -0.082928 0.903198 -2.40853
H  -0.914963 0.183513 -2.419506
H  0.584163 0.659891 -3.248907
C  -0.54302 2.36789 -2.430846
P  -0.493451 -3.942199 0.418391
C  -2.303049 -4.102395 0.352043
C  0.136897 -5.096827 -0.836532
H  1.597744 0.606533 0.768031
C  -0.006421 -4.659957 2.016006
H  -0.415668 -4.050767 2.834863
H  -0.38691 -5.688853 2.102902
H  1.09008 -4.669483 2.097529
H  -2.757135 -3.490747 1.14503
H  -2.596707 -5.153898 0.490582
H  -2.671003 -3.746727 -0.621226
H  -0.184189 -4.768149 -1.835531
H  -0.245752 -6.111054 -0.64671
H  1.235956 -5.110967 -0.806107
H  2.128628 2.082569 -2.333688
H  -0.530319 2.800691 -3.442319
H  -1.566974 2.448836 -2.045252
C  -0.090716 4.086074 -0.537398
C  -1.236338 4.831838 -0.858206
C  0.566262 4.323567 0.677014
C  -1.694365 5.809567 0.022003
H  -1.75967 4.6679 -1.802228
C  0.088462 5.290298 1.563964
H  1.448586 3.750943 0.969907
C  -1.045712 6.041618 1.231722
H  -2.576764 6.400705 -0.235533
H  -1.41623 6.801159 1.926802
O  0.755767 5.45811 2.722122
H  0.33867 6.157949 3.244064
totalener: -1136.50590486592068 hartree
nucrepener: 1487.20140431110940 hartree
electener: -2623.62747264194422 hartree
oneelecener: -4540.79403169950911 hartree
twoeener: 1917.16655905756465 hartree
cpcmener: -0.07381173208228 hartree
kineticenergy: 1042.00130032618677 hartree
energy: -2100.7551 -524.5307 -282.2716 -281.9164 -281.5636 -280.8541 -280.7487 -280.5616 -280.4666 -280.4500 -280.2696 -280.1694 -280.1670 -280.1240 -280.0432 -280.0395 -280.0309 -182.4463 -132.1468 -132.1467 -132.0887 -116.5808 -67.1781 -66.7866 -66.7829 -32.5883 -27.5391 -26.7183 -25.0361 -24.7624 -24.1048 -23.7373 -23.3703 -22.4329 -22.4258 -21.5865 -20.5846 -19.7913 -18.8998 -18.3690 -17.9485 -17.1047 -16.8295 -16.4387 -16.1061 -15.9918 -15.4632 -15.2527 -14.8544 -14.8515 -14.7833 -14.6538 -14.4935 -14.1301 -14.0174 -14.0065 -13.8060 -13.6687 -13.5348 -13.2572 -13.2193 -12.7066 -12.5651 -12.4750 -12.4154 -12.1233 -11.9413 -11.5738 -11.4247 -11.3731 -11.3609 -10.3781 -10.2313 -9.9448 -9.1475 -8.7622 -0.7693 0.5535 0.9202 1.1192 1.4432 1.5663 1.6858 1.8655 1.9911 2.1524 2.3838 electronvolt
chargesum: 1.0000000
charge: -0.104797 -0.067167 -0.439785 0.607904 -0.533504 0.221275 0.105927 0.212610 0.161547 -0.513183 0.544552 -0.783664 -0.779400 0.365645 -0.763454 0.252040 0.270873 0.250259 0.247083 0.279577 0.252366 0.252653 0.278560 0.246181 0.280396 0.225145 0.223298 0.715799 -0.636856 -0.539729 -0.265202 0.187276 0.489998 0.076535 -0.423579 0.241006 0.159321 -0.457650 0.160142
charge: 0.567064 -0.102826 -0.099346 -0.143763 0.216844 0.012601 -0.008120 0.036122 0.041831 0.037504 0.717278 -0.032788 -0.033006 -0.046314 -0.032576 -0.039876 -0.031110 -0.039791 -0.039764 -0.031074 -0.040138 -0.040139 -0.031092 -0.039961 0.019774 0.049590 0.031312 -0.135821 0.041632 0.111429 0.020791 0.021166 -0.260953 0.028840 0.068570 0.021488 0.031218 0.280106 -0.126702
qa: -0.1048 -0.0672 -0.4398 0.6079 -0.5335 0.2213 0.1059 0.2126 0.1615 -0.5132 0.5446 -0.7837 -0.7794 0.3656 -0.7635 0.2520 0.2709 0.2503 0.2471 0.2796 0.2524 0.2527 0.2786 0.2462 0.2804 0.2251 0.2233 0.7158 -0.6369 -0.5397 -0.2652 0.1873 0.4900 0.0765 -0.4236 0.2410 0.1593 -0.4576 0.1601
va: 1.8699 3.0561 3.7935 1.4212 3.4984 0.9679 3.7717 0.9848 1.0651 4.1971 3.6006 3.9896 3.9886 0.8500 3.9483 1.0501 1.0571 1.0527 1.0622 1.0474 1.0556 1.0514 1.0487 1.0644 0.9344 0.9579 0.9646 0.4806 3.0434 3.1160 3.1803 0.9705 2.9609 1.0169 3.3268 0.9018 0.9601 1.7973 1.0133
dispcorr: -0.016889616 hartree
energy: -1136.522794481701
