program: Orca
programVersion: 6.0.x
elementType: Au C C C C H C H H C P C C H C H H H H H H H H H H H H C C C C H C H C H H C H H H
elementType: Au
charge: 1
multiplicity: 1
keywords: wB97X-D3 def2-TZVPPD autoaux TightSCF
formula: C16H23AuP
InChI: InChI=1/C13H14.C3H9P.Au/c1-4-5-8-12(3)13-9-6-7-11(2)10-13;1-4(2)3;/h1,6-7,9-10H,3,5,8H2,2H3;1-3H3;/rC16H23AuP/c1-14-9-8-11-16(13-14)15(2)10-6-7-12-17-18(3,4)5/h8-9,11-13H,2,6,10H2,1,3-5H3
41 atoms
Au 0.272225 -1.738969 0.114316
C  0.993004 0.217499 -0.064318
C  0.694014 0.789595 -1.167951
C  0.444851 3.087406 -1.538999
C  1.74216 2.670013 -1.517122
H  2.44998 3.04059 -0.771661
C  -0.021694 0.911418 -2.46434
H  -0.84926 0.186949 -2.493758
H  0.666539 0.669861 -3.287966
C  -0.488001 2.374444 -2.501125
P  -0.482712 -3.91503 0.415385
C  -2.292306 -4.075897 0.35228
C  0.147364 -5.080932 -0.829114
H  1.587956 0.639824 0.750618
C  0.00588 -4.617445 2.019373
H  -0.399973 -3.998525 2.832596
H  -0.377059 -5.644376 2.117926
H  1.102531 -4.628871 2.098665
H  -2.74545 -3.455763 1.139198
H  -2.585803 -5.125864 0.502292
H  -2.661056 -3.730302 -0.624298
H  -0.174142 -4.76169 -1.831018
H  -0.234696 -6.093505 -0.629557
H  1.246443 -5.094312 -0.798923
H  2.182057 2.11626 -2.350523
H  -0.4483 2.804917 -3.512813
H  -1.522831 2.45165 -2.144901
C  -0.095688 4.077076 -0.580578
C  -1.229608 4.828139 -0.918551
C  0.514186 4.291268 0.667414
C  -1.720424 5.785946 -0.032467
H  -1.722238 4.684242 -1.883058
C  0.018011 5.230164 1.572347
H  1.384841 3.69587 0.955087
C  -1.107303 5.982273 1.20127
H  -2.595256 6.380454 -0.307905
H  -1.508222 6.727053 1.895333
C  0.669106 5.439547 2.913994
H  1.084582 6.456289 2.995946
H  -0.060017 5.320536 3.730186
H  1.487197 4.72485 3.080364
totalener: -1100.58597632727310 hartree
nucrepener: 1484.66982777621843 hartree
electener: -2585.17892209044658 hartree
oneelecener: -4484.47169120195485 hartree
twoeener: 1899.29276911150828 hartree
cpcmener: -0.06993549763732 hartree
kineticenergy: 1006.08441335658017 hartree
energy: -2100.7591 -282.2782 -281.5217 -280.8599 -280.6161 -280.5280 -280.4582 -280.4559 -280.4179 -280.2005 -280.1632 -280.1289 -280.0776 -280.0458 -280.0427 -280.0342 -279.6545 -182.4503 -132.1507 -132.1506 -132.0927 -116.5864 -67.1839 -66.7923 -66.7885 -27.5362 -26.7984 -25.1244 -24.7671 -24.3993 -24.0389 -23.2845 -22.4362 -22.4290 -22.0845 -21.4539 -20.1239 -19.3387 -18.3898 -18.2020 -17.4629 -17.0557 -16.3717 -16.1312 -15.9234 -15.4733 -15.1958 -14.8576 -14.8540 -14.7211 -14.5386 -14.4044 -14.1577 -14.0443 -14.0203 -14.0057 -13.6597 -13.5376 -13.3373 -13.1597 -13.0523 -12.8307 -12.5800 -12.4720 -12.0444 -11.9891 -11.9437 -11.5787 -11.4306 -11.3792 -11.3664 -10.3599 -10.2102 -9.9492 -9.4496 -8.8361 -0.7215 0.5454 0.9328 1.1150 1.3619 1.5798 1.7116 1.9274 2.0246 2.2654 2.4250 electronvolt
chargesum: 1.0000000
charge: -0.111095 -0.081441 -0.440562 0.513955 -0.507039 0.215572 0.127487 0.213459 0.156277 -0.557125 0.552592 -0.783538 -0.782219 0.370003 -0.768326 0.252339 0.272782 0.250222 0.246291 0.278458 0.254446 0.252113 0.277835 0.245916 0.278278 0.224705 0.225767 0.724342 -0.439059 -0.240633 -0.467390 0.201466 0.121249 0.043224 -0.292554 0.236020 0.195886 -0.955417 0.232424 0.231453 0.231834
charge: 0.566988 -0.103225 -0.096731 -0.148949 0.215466 0.011809 -0.007884 0.036429 0.041636 0.037800 0.717265 -0.032741 -0.032883 -0.046648 -0.032631 -0.039947 -0.031079 -0.039776 -0.039760 -0.031049 -0.040092 -0.040092 -0.031043 -0.039954 0.018650 0.048923 0.031293 -0.135411 0.047811 0.082149 0.020563 0.023864 -0.196662 0.022025 0.039377 0.018358 0.027847 0.155441 0.004485 0.002898 -0.004519
qa: -0.1111 -0.0814 -0.4406 0.5140 -0.5070 0.2156 0.1275 0.2135 0.1563 -0.5571 0.5526 -0.7835 -0.7822 0.3700 -0.7683 0.2523 0.2728 0.2502 0.2463 0.2785 0.2544 0.2521 0.2778 0.2459 0.2783 0.2247 0.2258 0.7243 -0.4391 -0.2406 -0.4674 0.2015 0.1212 0.0432 -0.2926 0.2360 0.1959 -0.9554 0.2324 0.2315 0.2318
va: 1.8784 3.0704 3.7769 1.5106 3.4843 0.9761 3.7275 0.9825 1.0664 4.2594 3.5919 3.9899 3.9885 0.8402 3.9502 1.0490 1.0559 1.0530 1.0629 1.0483 1.0526 1.0508 1.0500 1.0643 0.9339 0.9569 0.9618 0.4561 2.9572 2.2249 3.1983 0.9618 1.6860 0.9349 3.1605 0.9092 0.9785 3.5177 1.0086 1.0073 1.0103
dispcorr: -0.017607189 hartree
energy: -1100.603583516142
