program: Orca
programVersion: 6.0.x
elementType: Au C C C C H C H H C P C C H C H H H H H H H H H H H H C C C C H C H C H H H
elementType: Au
charge: 1
multiplicity: 1
keywords: wB97X-D3 def2-TZVPPD autoaux TightSCF
formula: C15H21AuP
InChI: InChI=1/C12H12.C3H9P.Au/c1-3-4-8-11(2)12-9-6-5-7-10-12;1-4(2)3;/h1,5-7,9-10H,2,4,8H2;1-3H3;/rC15H21AuP/c1-14(15-11-6-5-7-12-15)10-8-9-13-16-17(2,3)4/h5-7,11-13H,1,8,10H2,2-4H3
38 atoms
Au 0.320232 -1.563183 -0.038189
C  0.926753 0.390862 -0.478584
C  0.111146 1.041069 -1.218566
C  -0.21383 3.369199 -1.280474
C  0.878065 2.928928 -1.967997
H  1.888697 3.250001 -1.704189
C  -1.182264 1.253653 -1.91828
H  -1.923227 0.532845 -1.541783
H  -1.051616 1.070447 -2.995203
C  -1.541567 2.714508 -1.612911
P  -0.271176 -3.740094 0.516635
C  -1.913453 -3.872219 1.285404
C  -0.320064 -4.8640 -0.911371
H  1.883567 0.751674 -0.090092
C  0.876173 -4.510066 1.697658
H  0.898222 -3.922307 2.626779
H  0.556561 -5.538196 1.925019
H  1.888469 -4.530586 1.268797
H  -1.940087 -3.270902 2.205666
H  -2.135949 -4.922037 1.529213
H  -2.676619 -3.490682 0.591766
H  -1.050871 -4.495652 -1.645835
H  -0.606957 -5.876392 -0.589185
H  0.670319 -4.900746 -1.387679
H  0.783907 2.416193 -2.928652
H  -2.049457 3.210051 -2.453921
H  -2.20858 2.764682 -0.74308
C  -0.121975 4.326844 -0.156137
C  -1.244974 5.087939 0.205964
C  1.07436 4.508151 0.558174
C  -1.167345 6.019879 1.23881
H  -2.186928 4.969115 -0.334807
C  1.142688 5.423632 1.603436
H  1.957276 3.914137 0.311448
C  0.024152 6.186997 1.943238
H  -2.04648 6.61547 1.496987
H  2.077006 5.541466 2.157856
H  0.082241 6.910061 2.760881
totalener: -1061.26436437303983 hartree
nucrepener: 1361.24758726640198 hartree
electener: -2422.43494818577619 hartree
oneelecener: -4186.20373452844160 hartree
twoeener: 1763.76878634266518 hartree
cpcmener: -0.07044802031001 hartree
kineticenergy: 967.01386981169719 hartree
energy: -2100.7582 -282.2724 -281.5576 -280.8566 -280.6782 -280.5418 -280.4713 -280.4514 -280.3180 -280.3146 -280.2240 -280.1822 -280.1775 -280.0442 -280.0428 -280.0366 -182.4494 -132.1498 -132.1495 -132.0920 -116.5833 -67.1805 -66.7892 -66.7855 -27.5543 -26.7750 -25.0566 -24.7650 -24.0706 -23.8933 -23.3234 -22.4334 -22.4326 -21.5950 -20.1596 -19.7476 -18.4177 -18.3238 -17.7769 -17.1014 -16.4225 -16.1150 -15.7767 -15.4819 -15.2549 -14.8588 -14.8582 -14.8099 -14.6239 -14.4204 -14.1462 -14.0189 -14.0122 -13.7286 -13.5392 -13.4882 -13.2004 -13.0254 -12.5983 -12.4717 -12.2430 -12.0695 -11.9543 -11.6237 -11.4320 -11.3753 -11.3646 -10.4105 -10.2415 -9.9469 -9.7625 -8.8970 -0.7793 0.5668 0.9320 1.1164 1.2536 1.6035 1.7181 1.9682 2.0314 2.3305 2.4480 electronvolt
chargesum: 1.0000000
charge: -0.107929 -0.081933 -0.423617 0.574419 -0.530059 0.229410 0.103034 0.213279 0.161941 -0.487507 0.549946 -0.783894 -0.775666 0.358621 -0.759125 0.251582 0.272440 0.250910 0.248868 0.276235 0.255459 0.250078 0.278555 0.246261 0.285594 0.233154 0.220066 0.508022 -0.322710 -0.468865 -0.390084 0.178171 -0.464329 0.146170 -0.212846 0.240494 0.230133 0.245722
charge: 0.566662 -0.103817 -0.098895 -0.145385 0.214149 0.011374 -0.008879 0.036213 0.041821 0.036909 0.717250 -0.032697 -0.033016 -0.046652 -0.032449 -0.039727 -0.031103 -0.039904 -0.039887 -0.031056 -0.040157 -0.040192 -0.031133 -0.039835 0.018573 0.049718 0.032090 -0.138413 0.052926 0.053873 0.016677 0.024727 0.016025 0.019180 0.011261 0.018173 0.018105 0.017493
qa: -0.1079 -0.0819 -0.4236 0.5744 -0.5301 0.2294 0.1030 0.2133 0.1619 -0.4875 0.5499 -0.7839 -0.7757 0.3586 -0.7591 0.2516 0.2724 0.2509 0.2489 0.2762 0.2555 0.2501 0.2786 0.2463 0.2856 0.2332 0.2201 0.5080 -0.3227 -0.4689 -0.3901 0.1782 -0.4643 0.1462 -0.2128 0.2405 0.2301 0.2457
va: 1.8774 3.0897 3.7626 1.5082 3.4677 0.9596 3.7756 0.9892 1.0695 4.1647 3.6045 3.9848 3.9927 0.8606 3.9457 1.0508 1.0560 1.0511 1.0604 1.0513 1.0529 1.0535 1.0473 1.0642 0.9303 0.9540 0.9735 0.9148 2.9712 3.1519 3.1396 0.9708 3.2307 0.9694 3.0718 0.9113 0.9291 0.9059
dispcorr: -0.016169206 hartree
energy: -1061.280533579471
