program: Orca
programVersion: 6.0.x
elementType: Au C C C C H C H H C P C C H C H H H H H H H H H H H H C C C C H C H C H H C C H
elementType: Au
charge: 1
multiplicity: 1
keywords: wB97X-D3 def2-TZVPPD autoaux TightSCF
formula: C17H21AuP
InChI: InChI=1/C14H12.C3H9P.Au/c1-3-12-5-8-13(9-6-12)14-7-4-11(2)10-14;1-4(2)3;/h1-2,5-6,8-9H,4,7,10H2;1-3H3;/rC17H21AuP/c1-5-14-6-9-16(10-7-14)17-11-8-15(12-17)13-18-19(2,3)4/h1,6-7,9-10,13H,8,11-12H2,2-4H3
40 atoms
Au -0.360331 -2.420576 -0.033905
C  -1.005489 -0.490615 -0.303293
C  -0.271049 0.59784 -0.577177
C  0.291213 2.910434 -0.352782
C  -0.810228 2.00878 -0.746915
H  -0.952818 2.227847 -1.830125
C  1.230597 0.720715 -0.736196
H  1.506138 0.668557 -1.804003
H  1.785076 -0.067836 -0.210136
C  1.537949 2.122315 -0.197839
P  0.335682 -4.636741 0.281223
C  -1.00173 -5.768935 0.780134
C  1.060105 -5.409586 -1.201189
H  -2.087084 -0.287516 -0.225441
C  1.609023 -4.843144 1.56807
H  1.222323 -4.476728 2.530397
H  1.892419 -5.901689 1.670133
H  2.499051 -4.253473 1.303471
H  -1.442686 -5.421378 1.725916
H  -0.616892 -6.791456 0.913003
H  -1.787243 -5.774391 0.010263
H  0.325028 -5.398803 -2.019289
H  1.355861 -6.449017 -0.992772
H  1.944071 -4.837476 -1.519276
H  -1.776036 2.22466 -0.267475
H  1.696857 2.091812 0.900748
H  2.424909 2.61957 -0.615973
C  0.176204 4.310435 -0.143545
C  -1.074759 4.962088 -0.295657
C  1.309385 5.081863 0.222181
C  -1.18729 6.322836 -0.094529
H  -1.961524 4.391265 -0.575912
C  1.196175 6.441402 0.430788
H  2.283662 4.605533 0.34322
C  -0.052996 7.073833 0.272272
H  -2.150432 6.821567 -0.214078
H  2.068624 7.032296 0.71424
C  -0.170587 8.48743 0.484135
C  -0.274111 9.680489 0.662092
H  -0.361392 10.744897 0.8186
totalener: -1137.44903893421269 hartree
nucrepener: 1494.75858561342989 hartree
electener: -2632.11916092626689 hartree
oneelecener: -4553.99269170818297 hartree
twoeener: 1921.87353078191609 hartree
cpcmener: -0.08131748917853 hartree
kineticenergy: 1042.73175751597660 hartree
energy: -2100.3585 -283.1304 -282.0570 -281.3037 -281.2675 -281.2646 -280.8881 -280.8854 -280.6991 -280.6844 -280.6399 -280.6005 -280.1161 -280.0443 -279.8639 -279.8588 -279.8540 -279.3129 -182.0592 -131.7649 -131.7649 -131.6864 -116.0550 -66.6136 -66.2532 -66.2448 -28.3281 -27.4870 -25.7936 -24.7858 -24.5191 -24.3720 -23.8319 -23.2518 -22.2364 -22.2333 -21.6535 -20.9227 -20.3806 -18.7863 -18.7361 -18.1236 -17.8977 -17.1477 -16.7225 -16.5038 -16.0835 -15.6443 -15.2201 -15.1779 -14.9112 -14.6617 -14.6538 -14.4599 -14.3696 -14.0481 -13.8375 -13.8296 -13.7457 -13.4121 -13.3604 -13.2294 -12.7855 -12.6363 -12.2478 -12.2349 -12.0988 -12.0374 -11.4047 -11.0239 -10.8488 -10.8402 -10.8152 -10.4914 -9.9307 -9.6208 -9.0970 -8.9717 -2.3665 0.7266 0.7836 1.0198 1.2271 1.3984 1.6867 1.8532 2.0197 2.3503 2.4468 electronvolt
chargesum: 1.0000000
charge: -0.207685 -0.631027 -0.516112 0.311719 0.437383 0.239959 -0.236547 0.205148 0.213747 -0.126650 0.520759 -0.786005 -0.790573 0.182814 -0.801045 0.243219 0.276420 0.255246 0.245686 0.271306 0.248367 0.241843 0.278765 0.251965 0.261421 0.250122 0.239963 0.460172 -0.235463 -0.216167 -0.602318 0.149432 -0.612333 0.149252 0.381567 0.199548 0.203905 0.068795 -0.196473 0.169877
charge: 0.503932 -0.201580 -0.329299 0.046773 0.060369 0.090507 -0.002990 0.038272 0.011620 0.061593 0.706712 -0.041202 -0.041678 -0.098459 -0.041732 -0.043163 -0.034595 -0.043267 -0.043029 -0.034658 -0.042830 -0.043153 -0.034673 -0.043128 0.052932 0.082011 0.050956 -0.113376 0.120756 0.120042 0.087292 0.037487 0.087099 0.037475 -0.171831 0.038325 0.038278 -0.061587 0.241491 -0.047694
qa: -0.2077 -0.6310 -0.5161 0.3117 0.4374 0.2400 -0.2365 0.2051 0.2137 -0.1267 0.5208 -0.7860 -0.7906 0.1828 -0.8010 0.2432 0.2764 0.2552 0.2457 0.2713 0.2484 0.2418 0.2788 0.2520 0.2614 0.2501 0.2400 0.4602 -0.2355 -0.2162 -0.6023 0.1494 -0.6123 0.1493 0.3816 0.1995 0.2039 0.0688 -0.1965 0.1699
va: 1.7978 3.0820 2.9580 2.5941 3.3663 0.9483 4.0766 0.9878 0.9785 4.3579 3.4676 3.9630 3.9967 1.0282 3.9924 1.0686 1.0549 1.0527 1.0613 1.0600 1.0559 1.0718 1.0501 1.0510 0.9336 0.9799 0.9634 0.7345 2.7184 2.6778 2.8810 0.9750 2.9153 0.9784 1.2825 0.9690 0.9658 1.4088 3.5790 1.0145
dispcorr: -0.016398011 hartree
energy: -1137.465436945410
