program: Gaussian 09
title: 000066153
version: EM64L-G09RevD.01
frameworkgroup: C1[X(C3H5Cl3O)]
method: RPBEPBE
basis: SDD
operation: Freq
keyword: #p
keyword: freq=noraman
keyword: PBEPBE/SDD
title: #p freq=noraman PBEPBE/SDD
converged: YES YES NO NO
title: Mulliken charges:
elementType: Cl Cl Cl O C C C H H H H H
charge: 0.129083 0.062836 0.087608 -0.394866 0.017170 -0.574547 -0.658666 0.274085 0.249314 0.224598 0.238348 0.345038
chargesum: 0.00000
title: Mulliken charges with hydrogens summed into heavy atoms:
elementType: Cl Cl Cl O C C C
charge: 0.129083 0.062836 0.087608 -0.049828 0.291255 -0.574547 0.053594
polarizability: 6.24143362e+01 -8.06803806e-01 7.03506827e+01 -5.80701508e+00 -1.26545058e+00 6.24397209e+01
1716.lowfreq: -11.2149 -7.9391 0.0029 0.0034 0.0037 12.1843 86.8179 171.1072 185.5873
frequency: 86.7742 171.1039 185.5859 217.5624 246.0013 258.7906 276.9288 340.6972 358.5388 378.3608 460.7765 512.8529 719.8389 737.6208 851.8984 930.2019 1030.8116 1092.2007 1110.9505 1255.8409 1303.6520 1372.8468 1390.6320 1464.6949 1474.0484 3002.3178 3063.0120 3104.3978 3115.0309 3525.1852
redmass: 3.4970 9.6781 8.2279 1.2406 8.9774 4.9151 9.2132 1.3425 5.3166 4.7590 3.4142 4.1790 4.9931 8.6223 3.4120 2.7709 1.5005 3.0247 2.2507 1.4356 1.2929 1.1489 1.2009 1.0456 1.0497 1.0361 1.0859 1.0991 1.1000 1.0655
irintensity: 3.0695 0.3689 2.4729 3.1599 0.4148 3.0008 0.2897 98.0174 1.2612 48.6869 54.5366 63.0278 129.2210 137.2681 39.0801 32.9372 69.3480 20.0770 36.9130 31.1784 7.5301 21.5302 24.2599 18.1213 9.3610 10.4998 2.9970 14.5812 10.8281 11.0728
temp: 298.150 k
press: 1.00000 atm
elementType: 17 17 17 8 6 6 6 1 1 1 1 1
symmnumber: 1
zpe: 203599.4 jmol-1
zpe.correction: 0.077547 hartree
zpe.thermalcorrener: 0.086255 hartree
zpe.thermalcorrenthalpy: 0.087199 hartree
zpe.thermalcorrgfe: 0.043497 hartree
zpe.sumelectzpe: -1572.133814 hartree
zpe.sumelectthermal: -1572.125106 hartree
zpe.sumelectthermalent: -1572.124162 hartree
zpe.sumelectthermalfe: -1572.167864 hartree
dipole: -1.9187 1.1794 0.2090
dipole: 2.2619
quadrupole: -61.0000 -64.6907 -61.9372
quadrupole: -2.2017 -2.3128 -3.5753
quadrupole: 1.5426 -2.1481 0.6055 -2.2017 -2.3128 -3.5753
hfenergy: -1572.2113608 hartree
pointgroup: C01 [X(C3H5Cl3O1)]
dipole: -0.697831 0.5280736 0.1614435 debye
dipolederiv: -0.345223 0.2907472 0.1446501 0.2865117 -0.5072388 -0.1908652 0.11919 -0.1852974 -0.2394903 -0.2325901 -0.0083364 0.0624638 -0.0107056 -0.1798032 0.0763927 0.0555628 0.0597968 -0.806085 -0.3239129 -0.2801319 0.0707774 -0.2536631 -0.69646 0.1358795 0.0550244 0.1309605 -0.1869895 -0.7735127 -0.1418817 -0.0461719 -0.1040321 -0.6951473 0.0851526 -0.0307657 0.0968812 -0.1307315 0.5393327 0.1274173 0.0611096 0.1237838 0.3753797 -0.043484 0.0339712 -0.0595515 0.013542 0.7271154 -0.0443207 -0.2877741 0.0133926 1.3489369 0.0005824 -0.2917705 -0.0229602 1.2551485 -0.1646003 0.1257058 0.0270975 -0.0022174 -0.1201607 -0.0313043 -0.0411173 -0.0191809 0.0431843 0.023833 -0.0084366 -0.011039 -0.0152874 0.0468505 -0.0135609 0.0497175 0.0151993 -0.0434874 -0.091569 0.0175266 -0.0749942 0.0030195 0.088342 -0.0268532 -0.074471 -0.0229773 0.0680072 0.120005 0.0127369 -0.0065616 -0.0062252 0.0807076 0.0489885 0.0535258 -0.0081034 -0.1002595 0.0955568 -0.0969496 0.0444728 -0.0458026 -0.0605204 0.0361942 0.0279096 0.0432645 0.0921539 0.4255651 0.0059232 0.0159697 0.0112258 0.3191137 -0.0771222 0.0432231 -0.0280316 0.0350075 unknown
polarizability: 61.3065119|0.0842358|70.4708084|-5.8014727|-0.4716796|63.4274195 unknown
InChI: InChI=1S/C3H5Cl3O/c1-2(7)3(4,5)6/h2,7H,1H3
charge 0 multiplicity 1
12 atoms
Cl 1.482495 -1.420821 -0.721431
Cl 0.393747 -0.229722 1.841894
Cl 1.368418 1.580119 -0.408972
O  -1.596118 -1.295003 -0.408292
C  -0.950474 -0.007436 -0.633367
C  0.484592 -0.02072 -0.027823
C  -1.819855 1.164281 -0.145036
H  -0.81711 0.041951 -1.728306
H  -2.813859 1.061782 -0.611666
H  -1.941136 1.14632 0.952764
H  -1.393994 2.139279 -0.432751
H  -1.772807 -1.40193 0.563785
