program: Orca
programVersion: 6.0.x
elementType: Au C C C C H C H H C P C C H C H H H H H H H H H H H H C C C C H C H C H H C C H H H
elementType: Au
charge: 1
multiplicity: 1
keywords: wB97X-D3 def2-TZVPPD autoaux TightSCF
formula: C17H23AuP
InChI: InChI=1/C14H14.C3H9P.Au/c1-3-12-5-8-13(9-6-12)14-7-4-11(2)10-14;1-4(2)3;/h2-3,5-6,8-9H,1,4,7,10H2;1-3H3;/rC17H23AuP/c1-5-14-6-9-16(10-7-14)17-11-8-15(12-17)13-18-19(2,3)4/h5-7,9-10,13H,1,8,11-12H2,2-4H3
42 atoms
Au -0.376757 -2.476696 0.00668
C  -1.011539 -0.533917 -0.187491
C  -0.28459 0.538659 -0.535755
C  0.349673 2.840245 -0.375122
C  -0.807126 1.96032 -0.662023
H  -1.059247 2.175927 -1.724334
C  1.197587 0.626853 -0.836267
H  1.368214 0.569809 -1.925629
H  1.779877 -0.176714 -0.365728
C  1.58889 2.019592 -0.32874
P  0.319456 -4.70432 0.226826
C  -1.041556 -5.888505 0.481822
C  1.214321 -5.351295 -1.222846
H  -2.0761 -0.308665 -0.005362
C  1.448784 -5.002024 1.625674
H  0.952521 -4.719115 2.565589
H  1.738259 -6.062765 1.673133
H  2.351948 -4.385159 1.509317
H  -1.601487 -5.619327 1.38944
H  -0.651396 -6.912326 0.58616
H  -1.728413 -5.848491 -0.376309
H  0.567725 -5.295697 -2.110937
H  1.514701 -6.397383 -1.058748
H  2.111052 -4.741499 -1.406456
H  -1.711418 2.196315 -0.082435
H  1.852367 1.980635 0.74816
H  2.443291 2.493503 -0.832608
C  0.286683 4.235142 -0.16831
C  -0.956964 4.924974 -0.220133
C  1.462799 4.987051 0.097603
C  -1.018006 6.285457 -0.019929
H  -1.877416 4.375485 -0.425079
C  1.391394 6.347944 0.304029
H  2.433091 4.489286 0.142698
C  0.154529 7.025153 0.250725
H  -1.984941 6.78817 -0.072949
H  2.301171 6.916006 0.510632
C  0.141562 8.477711 0.478015
C  -0.95001 9.250925 0.52294
H  1.125672 8.934784 0.62482
H  -0.8572 10.325777 0.700178
H  -1.963201 8.859607 0.392641
totalener: -1138.70958264979231 hartree
nucrepener: 1527.68559635777297 hartree
electener: -2666.30935116350247 hartree
oneelecener: -4621.45143822604950 hartree
twoeener: 1955.14208706254703 hartree
cpcmener: -0.07777670606244 hartree
kineticenergy: 1043.95890024628784 hartree
energy: -2100.3488 -282.8965 -281.5618 -281.1565 -281.1273 -281.1052 -280.6384 -280.6297 -280.5880 -280.5416 -280.4966 -280.4070 -280.0656 -279.9895 -279.8534 -279.8507 -279.8439 -279.2740 -182.0491 -131.7549 -131.7548 -131.6761 -116.0375 -66.5955 -66.2356 -66.2275 -28.1551 -27.3141 -25.7586 -24.6292 -24.5097 -24.4164 -23.7231 -23.0616 -22.2278 -22.2206 -21.4250 -20.8944 -20.1739 -19.0372 -18.6573 -18.1108 -17.9225 -16.8715 -16.7293 -16.3329 -15.8619 -15.6020 -15.1754 -15.1218 -14.8288 -14.7938 -14.6485 -14.6448 -14.2896 -14.1953 -13.8251 -13.8177 -13.7147 -13.6814 -13.3700 -13.3503 -13.0830 -12.7498 -12.6498 -12.3074 -12.2216 -12.2122 -12.0414 -11.7397 -11.3855 -10.8307 -10.8248 -10.7966 -10.3771 -9.6136 -9.5680 -9.0590 -8.9251 -2.2309 0.6488 0.8939 1.0444 1.2404 1.4520 1.7166 1.8781 1.9978 2.3397 2.3851 electronvolt
chargesum: 1.0000000
charge: -0.203438 -0.626638 -0.520840 0.305331 0.412657 0.240197 -0.225916 0.207106 0.214372 -0.175456 0.536761 -0.787211 -0.798876 0.176049 -0.793578 0.242166 0.276227 0.250045 0.247261 0.268852 0.246923 0.244452 0.277561 0.251776 0.255107 0.239368 0.230938 0.585682 -0.488123 -0.443389 -0.429151 0.121633 -0.509220 0.136732 1.009713 0.116543 0.144217 -0.373568 -0.425734 0.172915 0.208637 0.181916
charge: 0.502917 -0.203236 -0.331106 0.035514 0.056933 0.085409 -0.006062 0.037505 0.010225 0.058316 0.706818 -0.041301 -0.041943 -0.099240 -0.041876 -0.043120 -0.034859 -0.043388 -0.042939 -0.034735 -0.042810 -0.043034 -0.034753 -0.043409 0.051099 0.077510 0.048478 -0.121887 0.116498 0.116942 0.083569 0.035995 0.078493 0.036266 -0.133192 0.023924 0.032851 -0.016510 0.219382 0.018574 -0.014801 -0.019015
qa: -0.2034 -0.6266 -0.5208 0.3053 0.4127 0.2402 -0.2259 0.2071 0.2144 -0.1755 0.5368 -0.7872 -0.7989 0.1760 -0.7936 0.2422 0.2762 0.2500 0.2473 0.2689 0.2469 0.2445 0.2776 0.2518 0.2551 0.2394 0.2309 0.5857 -0.4881 -0.4434 -0.4292 0.1216 -0.5092 0.1367 1.0097 0.1165 0.1442 -0.3736 -0.4257 0.1729 0.2086 0.1819
va: 1.8046 3.1011 2.9721 2.5803 3.3749 0.9498 4.0526 0.9880 0.9877 4.3782 3.4583 3.9671 3.9934 1.0392 3.9943 1.0692 1.0542 1.0586 1.0555 1.0610 1.0592 1.0678 1.0532 1.0533 0.9471 0.9901 0.9865 0.3744 2.8160 2.7425 3.0563 1.0147 2.7323 1.0014 0.9489 0.9842 0.9928 2.9669 3.5778 0.9738 0.9960 0.9550
dispcorr: -0.017084986 hartree
energy: -1138.726667635297
