program: Orca
programVersion: 6.0.x
elementType: Au C C C C H C H H C P C C H C H H H H H H H H H H H H C C C C H C H C H H O C H H H
elementType: Au
charge: 1
multiplicity: 1
keywords: wB97X-D3 def2-TZVPPD autoaux TightSCF
formula: C16H23AuOP
InChI: InChI=1/C13H14O.C3H9P.Au/c1-10-3-4-12(9-10)11-5-7-13(14-2)8-6-11;1-4(2)3;/h1,5-8H,3-4,9H2,2H3;1-3H3;/rC16H23AuOP/c1-18-16-9-7-14(8-10-16)15-6-5-13(11-15)12-17-19(2,3)4/h7-10,12H,5-6,11H2,1-4H3
42 atoms
Au -0.359225 -2.561541 -0.097564
C  -0.970853 -0.618173 -0.348155
C  -0.216926 0.463222 -0.600568
C  0.389236 2.766856 -0.339413
C  -0.732222 1.884116 -0.763638
H  -0.893334 2.107257 -1.839746
C  1.288487 0.559141 -0.73868
H  1.572689 0.524297 -1.805206
H  1.819711 -0.254975 -0.227097
C  1.62105 1.941665 -0.164942
P  0.302745 -4.791625 0.194587
C  -1.062747 -5.993377 0.085209
C  1.517489 -5.379615 -1.03011
H  -2.050256 -0.399095 -0.280699
C  1.081736 -5.132988 1.806336
H  0.377022 -4.888161 2.614556
H  1.368739 -6.192681 1.884093
H  1.977534 -4.505541 1.922433
H  -1.813948 -5.771634 0.857355
H  -0.690316 -7.019477 0.225848
H  -1.543488 -5.914826 -0.901026
H  1.091518 -5.292855 -2.040459
H  1.784969 -6.429857 -0.83837
H  2.424645 -4.759619 -0.980197
H  -1.686149 2.09892 -0.26029
H  1.775935 1.879649 0.930255
H  2.521734 2.419263 -0.576397
C  0.304058 4.145242 -0.125889
C  -0.933313 4.837411 -0.291796
C  1.449622 4.909828 0.26713
C  -1.03549 6.191129 -0.086515
H  -1.826219 4.284226 -0.589321
C  1.358374 6.257155 0.478546
H  2.413497 4.415428 0.401425
C  0.114694 6.920004 0.303588
H  -1.994896 6.690148 -0.22154
H  2.223478 6.851249 0.778185
O  0.120997 8.213201 0.524817
C  -1.069132 8.985946 0.383805
H  -1.445056 8.939226 -0.64883
H  -1.841554 8.642707 1.087691
H  -0.788231 10.016962 0.624326
totalener: -1175.85457639652418 hartree
nucrepener: 1566.49407619072144 hartree
electener: -2742.26485205087647 hartree
oneelecener: -4751.33616917797735 hartree
twoeener: 2009.07131712710111 hartree
cpcmener: -0.07687258448412 hartree
kineticenergy: 1081.04708919277141 hartree
energy: -2100.3361 -525.5397 -283.1292 -282.5549 -281.4872 -281.2818 -281.1679 -280.9610 -280.6659 -280.6083 -280.4643 -280.4189 -280.0032 -279.9184 -279.8441 -279.8429 -279.8368 -279.2254 -182.0364 -131.7424 -131.7421 -131.6632 -116.0183 -66.5758 -66.2162 -66.2085 -33.7902 -28.0096 -27.0754 -25.1797 -24.7829 -24.4974 -23.7484 -23.5913 -22.5157 -22.2198 -22.2120 -21.2363 -20.3600 -20.2382 -18.6791 -18.2357 -18.0952 -17.7011 -17.0683 -16.5348 -16.3951 -16.0907 -15.6939 -15.2449 -15.1563 -14.8727 -14.7792 -14.6399 -14.6348 -14.4866 -14.1157 -13.8985 -13.8185 -13.8018 -13.6648 -13.3768 -13.3429 -13.1733 -12.8544 -12.6314 -12.3801 -12.2070 -12.1838 -12.1030 -11.9880 -11.3648 -10.8161 -10.8015 -10.7719 -10.5260 -9.6947 -9.5900 -9.0239 -8.8729 -1.8273 0.8494 0.9156 1.2482 1.4174 1.6870 1.8375 1.9620 1.9804 2.2873 2.3496 electronvolt
chargesum: 1.0000000
charge: -0.211780 -0.658323 -0.473437 0.303418 0.363595 0.246023 -0.240701 0.208075 0.220985 -0.220682 0.524877 -0.787241 -0.800357 0.178909 -0.790366 0.242995 0.275781 0.249628 0.249387 0.269642 0.246468 0.245930 0.277119 0.251604 0.260183 0.243818 0.236768 0.498983 -0.591708 -0.546709 -0.199199 0.119193 -0.474134 0.124679 1.098875 0.180080 0.186788 -0.475245 -0.502406 0.249166 0.251154 0.168163
charge: 0.501122 -0.206647 -0.332870 0.016040 0.052159 0.077728 -0.009575 0.036606 0.009178 0.053277 0.706332 -0.041559 -0.041697 -0.100616 -0.042297 -0.043268 -0.034887 -0.043596 -0.042926 -0.034836 -0.043057 -0.043203 -0.034915 -0.043212 0.047709 0.071335 0.044904 -0.129257 0.122507 0.112524 0.110110 0.039155 0.111578 0.037273 -0.208690 0.026151 0.039234 0.013914 0.168341 0.027739 0.027847 0.024346
qa: -0.2118 -0.6583 -0.4734 0.3034 0.3636 0.2460 -0.2407 0.2081 0.2210 -0.2207 0.5249 -0.7872 -0.8004 0.1789 -0.7904 0.2430 0.2758 0.2496 0.2494 0.2696 0.2465 0.2459 0.2771 0.2516 0.2602 0.2438 0.2368 0.4990 -0.5917 -0.5467 -0.1992 0.1192 -0.4741 0.1247 1.0989 0.1801 0.1868 -0.4752 -0.5024 0.2492 0.2512 0.1682
va: 1.7889 3.0874 2.9318 2.5243 3.3996 0.9428 4.0293 0.9868 0.9819 4.3536 3.4747 3.9643 3.9876 1.0332 3.9943 1.0699 1.0542 1.0569 1.0546 1.0609 1.0595 1.0669 1.0547 1.0559 0.9407 0.9878 0.9788 0.1709 2.7551 2.6421 3.0183 0.9936 3.3566 1.0033 2.3997 0.9314 0.9918 1.6643 3.7858 0.9617 0.9601 1.0449
dispcorr: -0.017194991 hartree
energy: -1175.871771387141
