program: Orca
programVersion: 6.0.x
elementType: Au C C C C H C H H C P C C H C H H H H H H H H H H H H C C C C H C H C H H O H
elementType: Au
charge: 1
multiplicity: 1
keywords: wB97X-D3 def2-TZVPPD autoaux TightSCF
formula: C15H21AuOP
InChI: InChI=1/C12H12O.C3H9P.Au/c1-9-2-3-11(8-9)10-4-6-12(13)7-5-10;1-4(2)3;/h1,4-7,13H,2-3,8H2;1-3H3;/rC15H21AuOP/c1-18(2,3)16-11-12-4-5-14(10-12)13-6-8-15(17)9-7-13/h6-9,11,17H,4-5,10H2,1-3H3
39 atoms
Au -0.374998 -2.204935 -0.02933
C  -1.041448 -0.275498 -0.247282
C  -0.316966 0.81872 -0.528953
C  0.263403 3.131146 -0.289793
C  -0.860454 2.231736 -0.667414
H  -1.068458 2.454818 -1.73563
C  1.179994 0.938492 -0.728123
H  1.422144 0.908587 -1.805159
H  1.743833 0.132891 -0.238459
C  1.513494 2.32536 -0.166086
P  0.367721 -4.4134 0.230305
C  -0.918421 -5.576147 0.790812
C  1.027873 -5.162421 -1.293826
H  -2.120806 -0.076552 -0.133554
C  1.710159 -4.605827 1.44762
H  1.364644 -4.260546 2.433124
H  2.022038 -5.658761 1.520944
H  2.572462 -3.992789 1.146824
H  -1.321766 -5.239168 1.757101
H  -0.504142 -6.58953 0.90368
H  -1.739953 -5.599918 0.059724
H  0.252901 -5.15457 -2.074207
H  1.348513 -6.199278 -1.110939
H  1.886916 -4.574805 -1.649458
H  -1.795849 2.432489 -0.125046
H  1.709764 2.264371 0.922737
H  2.390511 2.817345 -0.610163
C  0.165444 4.509606 -0.072873
C  -1.088281 5.184939 -0.190642
C  1.315054 5.285739 0.27674
C  -1.190364 6.535657 0.022345
H  -1.985673 4.622672 -0.455577
C  1.220459 6.634336 0.495692
H  2.288296 4.801173 0.373823
C  -0.034908 7.274082 0.368889
H  -2.151131 7.048858 -0.068741
H  2.091258 7.234836 0.764319
O  -0.072587 8.572285 0.586079
H  -0.973995 8.920994 0.481137
totalener: -1136.55503836710886 hartree
nucrepener: 1451.95497020335984 hartree
electener: -2588.42109634178814 hartree
oneelecener: -4471.04360374718726 hartree
twoeener: 1882.62250740539889 hartree
cpcmener: -0.08145029933500 hartree
kineticenergy: 1041.99045264884785 hartree
energy: -2100.3383 -525.5879 -283.2249 -282.6256 -281.3097 -281.2610 -281.0205 -280.7409 -280.6604 -280.4933 -280.4486 -280.0185 -279.9352 -279.8493 -279.8449 -279.8423 -279.2377 -182.0390 -131.7451 -131.7446 -131.6658 -116.0233 -66.5807 -66.2211 -66.2134 -33.7910 -28.0521 -27.0948 -25.0417 -24.8284 -24.5017 -23.6800 -23.1202 -22.2224 -22.2180 -21.4515 -21.1610 -20.2873 -19.0168 -18.6958 -18.0996 -17.8577 -16.9167 -16.4937 -16.1626 -15.6484 -15.5330 -15.2883 -15.1649 -14.9466 -14.6452 -14.6380 -14.5669 -14.4087 -13.9448 -13.8229 -13.8068 -13.7010 -13.3566 -13.3465 -13.2427 -12.8853 -12.5812 -12.3532 -12.2115 -12.1893 -12.0026 -11.3689 -10.8181 -10.8081 -10.7833 -10.5753 -9.8631 -9.5950 -9.0344 -8.8890 -1.8621 0.8114 0.8848 1.2437 1.3790 1.6023 1.7921 1.8961 2.0030 2.2899 2.4381 electronvolt
chargesum: 1.0000000
charge: -0.201238 -0.632385 -0.474218 0.319038 0.347196 0.236670 -0.221315 0.205656 0.208268 -0.196802 0.529555 -0.787941 -0.794545 0.177389 -0.803547 0.243220 0.275745 0.256288 0.246955 0.269558 0.248271 0.244050 0.276118 0.250729 0.258498 0.241589 0.234729 0.374040 -0.480692 -0.439769 -0.267845 0.138259 -0.437524 0.136782 0.931762 0.156901 0.201875 -0.437735 0.166414
charge: 0.501893 -0.205764 -0.332765 0.018772 0.053350 0.078647 -0.009481 0.036815 0.008817 0.054085 0.706523 -0.041340 -0.042032 -0.100239 -0.042126 -0.043268 -0.034776 -0.043450 -0.043160 -0.034852 -0.042677 -0.043354 -0.034825 -0.043239 0.048492 0.072319 0.045298 -0.127153 0.117982 0.116824 0.107476 0.039219 0.106003 0.038226 -0.214796 0.041712 0.039296 0.340299 -0.092748
qa: -0.2012 -0.6324 -0.4742 0.3190 0.3472 0.2367 -0.2213 0.2057 0.2083 -0.1968 0.5296 -0.7879 -0.7945 0.1774 -0.8035 0.2432 0.2757 0.2563 0.2470 0.2696 0.2483 0.2440 0.2761 0.2507 0.2585 0.2416 0.2347 0.3740 -0.4807 -0.4398 -0.2678 0.1383 -0.4375 0.1368 0.9318 0.1569 0.2019 -0.4377 0.1664
va: 1.7985 3.0686 3.0319 2.5477 3.4465 0.9561 4.0328 0.9930 0.9900 4.3011 3.4584 3.9612 3.9980 1.0371 3.9899 1.0691 1.0555 1.0529 1.0600 1.0617 1.0563 1.0690 1.0525 1.0548 0.9471 0.9903 0.9834 0.6310 3.1767 2.9696 3.2623 0.9825 3.2964 0.9967 2.6813 0.9616 0.9498 1.8873 1.0188
dispcorr: -0.016097865 hartree
energy: -1136.571136232285
