program: Gaussian 09
title: 000066160
version: EM64L-G09RevD.01
frameworkgroup: C1[X(C11H10N2O3)]
method: RPBEPBE
basis: SDD
operation: Freq
keyword: #p
keyword: freq=noraman
keyword: PBEPBE/SDD
title: #p freq=noraman PBEPBE/SDD
converged: NO YES NO NO
title: Mulliken charges:
elementType: O O O N N C C C C C C C C C C C H H H H H H H H H H
charge: -0.190267 -0.192308 -0.214396 -0.380047 -0.376406 -0.093335 0.475786 -0.765399 0.181729 0.185770 -0.349341 -0.381692 0.158087 -0.242549 -0.236206 -0.235275 0.255790 0.233563 0.254091 0.367487 0.367276 0.227954 0.252783 0.231408 0.230963 0.234534
chargesum: 0.00000
title: Mulliken charges with hydrogens summed into heavy atoms:
elementType: O O O N N C C C C C C C C C C C
charge: -0.190267 -0.192308 -0.214396 -0.012560 -0.009130 -0.093335 0.475786 -0.021955 0.181729 0.185770 -0.121387 -0.128910 0.158087 -0.011140 -0.005243 -0.000741
polarizability: 1.66263393e+02 -1.29536895e+01 1.34795478e+02 2.56659134e-01 -1.18642650e-01 1.03099127e+02
1716.lowfreq: -17.4387 -8.9222 -7.6928 -0.0010 -0.0009 -0.0007 4.6766 39.0668 80.9974
frequency: -14.8850 39.0231 80.9941 134.8938 137.5258 176.5546 220.3282 259.5913 282.3133 288.7065 293.1159 356.9880 373.8678 399.6965 435.2859 478.1965 491.8051 512.5500 602.8250 615.5911 631.8926 656.4532 678.1898 699.9535 703.7138 717.3378 747.8515 774.6998 789.1943 845.1815 858.5130 875.2352 926.1949 975.4236 989.1008 991.7379 998.9651 1024.8446 1069.6667 1079.6298 1121.7553 1130.3820 1174.6871 1178.9011 1200.9115 1216.2920 1292.0636 1327.1075 1361.7409 1374.1214 1377.9658 1379.3108 1387.9423 1434.7302 1473.5780 1481.9234 1485.9328 1592.8716 1606.9636 1621.7966 1659.3121 1676.5073 3011.1383 3105.8158 3128.0483 3133.2891 3136.2753 3148.8016 3164.4610 3178.1067 3517.3577 3519.3164
redmass: 3.8851 10.0205 6.6072 9.1093 5.9530 7.1313 3.2895 4.5256 1.4880 1.9924 3.1637 11.8354 10.1347 2.7646 5.9172 9.3878 3.6216 6.0001 8.6581 6.4961 4.2414 2.5409 2.5682 1.6571 6.9480 6.0182 1.7012 2.0714 1.6640 1.2621 3.3202 1.9790 1.5167 1.3938 4.3353 4.7447 1.3248 2.6941 2.4635 1.7304 2.5583 2.5294 1.7421 1.4967 1.1220 5.9359 3.8865 1.4335 10.5705 1.8723 1.4221 6.0908 1.3192 2.1670 1.1165 1.8196 1.0987 6.0435 6.0605 7.1148 9.1678 5.3589 1.0357 1.0988 1.0853 1.1027 1.0880 1.0936 1.0976 1.0969 1.0757 1.0781
irintensity: 0.1160 0.8510 0.3744 7.0751 0.8894 3.3368 0.8777 1.0902 3.2767 5.3016 2.4104 28.1121 3.9684 0.0243 4.3777 16.7502 8.3536 25.5498 0.7808 0.2662 0.3034 4.3398 32.3349 54.1700 1.8992 6.6684 8.7787 29.8782 220.6332 0.0287 20.2913 2.0572 1.0868 0.1678 5.5013 1.2958 0.0022 12.3871 1.1327 15.4257 0.2115 8.8221 1.0767 0.9225 1.0497 61.2600 329.8135 18.7883 272.3436 5.2278 2.4703 1.0619 39.4983 5.6934 28.0737 16.2757 6.1012 2.0248 7.2062 346.4911 66.7310 602.8288 10.2765 19.9910 3.4646 2.8794 2.3657 24.3063 24.3425 8.4078 88.4306 44.9562
temp: 298.150 k
press: 1.00000 atm
elementType: 8 8 8 7 7 6 6 6 6 6 6 6 6 6 6 6 1 1 1 1 1 1 1 1 1 1
symmnumber: 1
zpe: 513276.0 jmol-1
zpe.correction: 0.195496 hartree
zpe.thermalcorrener: 0.208155 hartree
zpe.thermalcorrenthalpy: 0.209099 hartree
zpe.thermalcorrgfe: 0.156424 hartree
zpe.sumelectzpe: -759.252756 hartree
zpe.sumelectthermal: -759.240097 hartree
zpe.sumelectthermalent: -759.239153 hartree
zpe.sumelectthermalfe: -759.291829 hartree
dipole: -1.5674 -0.3095 -0.0287
dipole: 1.5979
quadrupole: -88.5452 -89.5227 -104.9938
quadrupole: 5.5845 0.4177 0.1672
quadrupole: 5.8087 4.8312 -10.6399 5.5845 0.4177 0.1672
hfenergy: -759.4482523 hartree
pointgroup: C01 [X(C11H10N2O3)]
dipole: -0.6183865 0.1069341 0.0373303 debye
dipolederiv: -0.4994629 -0.1073937 -0.0754011 -0.1488591 -0.3993893 -0.0440293 -0.0687174 -0.1786667 -1.0400991 -0.4982556 -0.1328085 0.0180268 -0.1647066 -0.6386641 0.2586869 -0.0172904 0.3939869 -0.8016527 -0.9513041 -0.4207363 -0.1082418 -0.5056034 -0.7330628 -0.0434055 -0.1294409 -0.043416 -0.5883129 -0.8971562 -0.3021691 -0.5356115 -0.4048652 -0.5300063 -0.3849961 -0.3372168 -0.1750794 -0.9471239 -0.9082586 -0.5172755 0.3240788 -0.5334699 -0.850338 0.4200483 0.0965706 0.2140584 -0.6153878 -0.2792593 -0.0470523 -0.0136083 -0.0838918 -0.0089434 0.0563289 -0.0288695 0.0555827 -0.1985132 0.3366021 -0.1129621 -0.0248872 -0.2196538 0.0144637 0.0273732 -0.0539477 0.0265045 -0.1003477 0.0181422 -0.0121415 -0.0042645 0.0316501 0.0269902 0.0150625 0.010994 0.0112664 -0.0211223 1.0054928 0.4899582 0.2797601 0.6993077 0.5330437 0.2860249 -0.0890722 0.1677185 1.190973 1.0027626 0.5617049 -0.0054814 0.5801197 0.8702294 -0.4493117 0.4358579 -0.3347217 0.8554975 -0.0777846 0.0946784 0.0152067 0.0634726 -0.0758684 0.0102461 0.0071629 0.0091949 -0.1277689 -0.1463099 0.0129987 0.0052812 0.1043607 0.0384075 0.0314646 0.0222584 0.0306692 -0.1120662 1.3000511 0.6787356 0.1655642 0.8532555 1.014234 -0.1673791 0.2094188 -0.1647804 1.6679123 -0.0504047 0.0108727 0.0006052 -0.0094475 0.1233515 0.0533618 -0.002774 0.0532609 -0.1236222 0.0847398 0.0977257 0.0128672 0.1037685 -0.0168028 0.0212533 0.0155803 0.0188076 -0.121453 0.043445 -0.0759626 -0.0236598 -0.0847772 -0.0285981 0.0276163 -0.02399 0.028806 -0.1461211 0.0558714 -0.0291068 -0.0822989 -0.0062263 0.0865629 0.0006471 -0.0963086 -0.0174491 -0.0030344 -0.101891 0.1180843 0.0324169 0.0597922 0.0456125 -0.0147578 0.0176416 -0.016495 0.0957356 0.0592891 -0.0660997 0.0574952 -0.0512096 0.0593859 0.034021 0.0797369 0.0560442 0.0232775 0.2557516 -0.0757415 -0.0366611 -0.0981767 0.2572952 -0.0247311 -0.0700793 -0.0240457 0.1952484 0.2548425 -0.0850513 -0.0050009 -0.1210001 0.2234993 0.0394725 0.0160444 0.0376054 0.2300054 -0.0573443 -0.0873635 -0.0130534 -0.0909208 0.0646236 -0.0108335 -0.0163683 -0.0094842 0.1206372 0.1358888 -0.0027404 -0.001127 -0.0041546 -0.0585876 -0.0397198 -0.0010771 -0.0368976 0.1207725 0.0729395 -0.0064158 0.0010187 0.02048 -0.1005036 -0.053697 0.007254 -0.0534796 0.1432706 -0.084981 -0.073206 -0.0085071 -0.0832519 0.038609 -0.0222457 -0.0095375 -0.0227438 0.1521863 -0.0734064 0.0894678 0.0254832 0.0940074 0.0444561 -0.0265008 0.0261697 -0.0262463 0.1511091 unknown
polarizability: 165.8583762|13.2405003|133.8613332|2.286995|6.4119743|104.4382889 unknown
InChI: InChI=1S/C11H10N2O3/c1-11(7-5-3-2-4-6-7)8(14)12-10(16)13-9(11)15/h2-6,12-13H,1H3
charge 0 multiplicity 1
26 atoms
O  0.71944 -0.414759 -2.610942
O  0.694057 -1.609761 2.087263
O  3.493024 1.714071 0.446431
N  2.026464 0.6711 -1.045625
N  2.007601 0.09626 1.247666
C  0.260632 -0.939653 -0.24604
C  -1.099714 -0.195585 -0.058236
C  0.099311 -2.433012 -0.626981
C  1.005403 -0.232918 -1.402816
C  0.990289 -0.870906 1.117386
C  -1.106194 1.194194 0.234296
C  -2.335355 -0.876468 -0.163125
C  2.567203 0.893427 0.233538
C  -2.32166 1.886448 0.416011
C  -3.552733 -0.182286 0.019268
C  -3.552289 1.199691 0.309274
H  -0.45192 -2.522719 -1.575841
H  1.089604 -2.900785 -0.762881
H  -0.422449 -2.973885 0.177655
H  2.467327 1.19442 -1.809601
H  2.432543 0.197582 2.175518
H  -0.166033 1.750935 0.320791
H  -2.362041 -1.945664 -0.386787
H  -2.307884 2.958533 0.640213
H  -4.500982 -0.724122 -0.065539
H  -4.497345 1.735163 0.450304
