program: Orca
programVersion: 6.0.x
elementType: Au C C C C H C H H C P C C H C H H H H H H H H H H H H C C C C H C H C H O C H H H O C H H H
elementType: Au
charge: 1
multiplicity: 1
keywords: wB97X-D3 def2-TZVPPD autoaux TightSCF
formula: C17H25AuO2P
InChI: InChI=1/C14H16O2.C3H9P.Au/c1-10-4-5-11(8-10)12-6-7-13(15-2)14(9-12)16-3;1-4(2)3;/h1,6-7,9H,4-5,8H2,2-3H3;1-3H3;/rC17H25AuO2P/c1-19-16-9-8-15(11-17(16)20-2)14-7-6-13(10-14)12-18-21(3,4)5/h8-9,11-12H,6-7,10H2,1-5H3
46 atoms
Au -0.426491 -3.050049 -0.001147
C  -1.211879 -1.163057 -0.194738
C  -0.589648 -0.054745 -0.626321
C  -0.08966 2.284016 -0.523453
C  -1.212435 1.327892 -0.738804
H  -1.555575 1.501201 -1.780772
C  0.855924 0.119251 -1.043148
H  0.940308 0.064041 -2.142823
H  1.521658 -0.646011 -0.621449
C  1.202762 1.536526 -0.572233
P  0.45758 -5.209642 0.228405
C  -0.770756 -6.544553 0.058589
C  1.744762 -5.61406 -0.996472
H  -2.271945 -1.003509 0.066622
C  1.249096 -5.521506 1.840017
H  0.509055 -5.390145 2.643171
H  1.656636 -6.542871 1.884987
H  2.063237 -4.798693 1.996438
H  -1.549882 -6.425458 0.82576
H  -0.294838 -7.530248 0.17386
H  -1.24536 -6.48459 -0.931864
H  1.326466 -5.531934 -2.010406
H  2.125093 -6.635287 -0.842481
H  2.576434 -4.900185 -0.903634
H  -2.084073 1.502142 -0.092163
H  1.574694 1.521652 0.470844
H  1.971852 2.0544 -1.163661
C  -0.211226 3.656164 -0.29187
C  -1.492623 4.268782 -0.2354
C  0.950394 4.475493 -0.095847
C  -1.623645 5.618442 0.002971
H  -2.393358 3.670782 -0.381966
C  0.834369 5.8195 0.148436
H  1.938369 4.018121 -0.138969
C  -0.477377 6.410974 0.202938
H  -2.614461 6.070328 0.041896
O  -0.499051 7.696765 0.445366
C  -1.736302 8.40014 0.526683
H  -2.276188 8.348604 -0.430227
H  -2.359646 7.998298 1.339071
H  -1.4755 9.441222 0.745319
O  1.843355 6.673842 0.348485
C  3.164596 6.175103 0.302461
H  3.397159 5.745424 -0.686267
H  3.826016 7.029824 0.486919
H  3.334565 5.414008 1.082256
totalener: -1290.39009352404923 hartree
nucrepener: 1845.45922585240305 hartree
electener: -3135.76526210312659 hartree
oneelecener: -5462.68987293244845 hartree
twoeener: 2326.92461082932186 hartree
cpcmener: -0.07808843828287 hartree
kineticenergy: 1195.09054557012746 hartree
energy: -2100.3340 -525.5595 -524.8615 -283.1269 -282.4783 -282.3205 -281.4903 -281.2579 -281.2114 -280.9724 -280.8415 -280.6647 -280.4387 -280.3962 -279.9939 -279.9016 -279.8443 -279.8422 -279.8376 -279.2180 -182.0345 -131.7404 -131.7402 -131.6615 -116.0118 -66.5690 -66.2099 -66.2023 -33.9561 -32.9961 -27.9460 -27.0158 -25.2264 -24.7305 -24.4959 -23.7757 -23.5962 -22.8836 -22.3807 -22.2203 -22.2155 -21.1689 -20.3096 -19.9277 -18.7152 -18.2348 -18.0941 -17.7581 -17.4132 -17.0142 -16.7433 -16.2729 -15.9563 -15.9014 -15.6599 -15.3201 -15.1390 -14.8189 -14.7615 -14.6393 -14.6358 -14.3833 -14.0825 -13.9121 -13.8210 -13.8043 -13.7966 -13.4283 -13.3435 -13.2158 -12.8706 -12.6189 -12.3826 -12.3230 -12.2157 -12.2036 -12.1746 -12.1582 -11.9765 -11.3608 -10.8174 -10.7937 -10.7651 -10.1043 -9.5868 -9.1605 -8.9750 -8.8221 -1.8339 0.8689 1.2270 1.2616 1.3967 1.6699 1.7480 1.8317 2.0660 2.1135 2.3378 electronvolt
chargesum: 1.0000000
charge: -0.209029 -0.641990 -0.500541 0.347416 0.382112 0.243188 -0.230599 0.210902 0.217558 -0.181617 0.525089 -0.795980 -0.799164 0.183437 -0.783600 0.243004 0.275630 0.246379 0.252924 0.268560 0.244322 0.245656 0.276931 0.257710 0.253645 0.246408 0.238193 0.150165 -0.943379 -0.654487 -0.200742 0.113900 0.819282 0.072763 1.206963 0.156116 -0.418200 -0.605843 0.276929 0.275982 0.154057 -0.500037 -0.591656 0.263317 0.149655 0.258672
charge: 0.501441 -0.205857 -0.333606 0.015921 0.051997 0.076738 -0.010449 0.036436 0.008121 0.053126 0.706594 -0.041361 -0.042074 -0.100659 -0.042282 -0.043058 -0.034852 -0.043791 -0.042960 -0.034714 -0.043070 -0.043396 -0.034853 -0.043449 0.045536 0.070265 0.046861 -0.127504 0.120483 0.154726 0.114788 0.038681 -0.175439 0.022526 -0.146191 0.027772 0.030725 0.176786 0.029763 0.029530 0.026131 -0.013251 0.140183 0.027283 0.023324 0.027080
qa: -0.2090 -0.6420 -0.5005 0.3474 0.3821 0.2432 -0.2306 0.2109 0.2176 -0.1816 0.5251 -0.7960 -0.7992 0.1834 -0.7836 0.2430 0.2756 0.2464 0.2529 0.2686 0.2443 0.2457 0.2769 0.2577 0.2536 0.2464 0.2382 0.1502 -0.9434 -0.6545 -0.2007 0.1139 0.8193 0.0728 1.2070 0.1561 -0.4182 -0.6058 0.2769 0.2760 0.1541 -0.5000 -0.5917 0.2633 0.1497 0.2587
va: 1.8010 3.0896 2.9980 2.5068 3.4699 0.9374 4.0494 0.9768 0.9784 4.3427 3.4783 3.9658 3.9776 1.0281 4.0001 1.0705 1.0510 1.0607 1.0503 1.0603 1.0630 1.0672 1.0538 1.0521 0.9395 0.9838 0.9828 -0.3132 2.8346 2.4598 2.9884 1.0179 2.4445 1.0459 1.6951 0.9611 1.6016 3.7590 0.9331 0.9344 1.0701 1.4016 3.7578 0.9528 1.0609 0.9569
dispcorr: -0.019201811 hartree
energy: -1290.409295335004
