program: Orca
programVersion: 6.0.x
elementType: Au C C C C H C H H C P C C H C H H H H H H H H H H H H C C C C H C H C H H N O O
elementType: Au
charge: 1
multiplicity: 1
keywords: wB97X-D3 def2-TZVPPD autoaux TightSCF
formula: C15H20AuNO2P
InChI: InChI=1/C12H11NO2.C3H9P.Au/c1-9-2-3-11(8-9)10-4-6-12(7-5-10)13(14)15;1-4(2)3;/h1,4-7H,2-3,8H2;1-3H3;/rC15H20AuNO2P/c1-20(2,3)16-11-12-4-5-14(10-12)13-6-8-15(9-7-13)17(18)19/h6-9,11H,4-5,10H2,1-3H3
40 atoms
Au -0.383536 -2.804493 0.089055
C  -1.06244 -0.874618 -0.087304
C  -0.38657 0.193468 -0.53506
C  0.220964 2.502565 -0.510562
C  -0.935716 1.606669 -0.63737
H  -1.2593 1.801015 -1.689396
C  1.053949 0.293745 -0.994742
H  1.113741 0.201491 -2.093199
H  1.702384 -0.477691 -0.559051
C  1.463742 1.710659 -0.581324
P  0.376699 -5.011952 0.295831
C  -0.884755 -6.187989 0.883016
C  0.987285 -5.733801 -1.261519
H  -2.105155 -0.653272 0.196119
C  1.76044 -5.213014 1.464269
H  1.44535 -4.887072 2.466404
H  2.081335 -6.264824 1.509331
H  2.608119 -4.589006 1.145221
H  -1.256426 -5.866474 1.866996
H  -0.462173 -7.200677 0.967579
H  -1.730527 -6.205183 0.180033
H  0.183666 -5.722645 -2.012344
H  1.323646 -6.769979 -1.104937
H  1.82747 -5.133419 -1.640333
H  -1.803432 1.85823 -0.010981
H  1.809394 1.721857 0.47698
H  2.269495 2.185269 -1.158971
C  0.157689 3.926558 -0.334019
C  -1.091929 4.57036 -0.190483
C  1.344308 4.693571 -0.301109
C  -1.157337 5.943824 -0.019706
H  -2.01863 3.995642 -0.207874
C  1.286776 6.06686 -0.127123
H  2.318289 4.215571 -0.413958
C  0.035378 6.658151 0.009024
H  -2.111527 6.457866 0.092567
H  2.190618 6.674851 -0.099269
N  -0.030499 8.128586 0.197342
O  -1.125396 8.627592 0.306168
O  1.015012 8.733217 0.23055
totalener: -1265.82729173560438 hartree
nucrepener: 1665.79103961402234 hartree
electener: -2931.51850225348107 hartree
oneelecener: -5070.71834246219805 hartree
twoeener: 2139.19984020871698 hartree
cpcmener: -0.09303977601062 hartree
kineticenergy: 1170.86638494687941 hartree
energy: -2100.3840 -525.0966 -525.0961 -399.9661 -283.5182 -282.6650 -281.6522 -281.5069 -281.5051 -281.2378 -281.2358 -280.8667 -280.8298 -280.2164 -280.1558 -279.8810 -279.8793 -279.8727 -279.3939 -182.0846 -131.7903 -131.7899 -131.7122 -116.0911 -66.6505 -66.2894 -66.2809 -37.9725 -33.0749 -28.6790 -27.8629 -26.1803 -25.0904 -24.5396 -24.3473 -23.9687 -22.7648 -22.2564 -22.2499 -21.3932 -20.8059 -20.2747 -19.1785 -18.8719 -18.6148 -18.1979 -18.0669 -17.8477 -16.9443 -16.7369 -16.2595 -16.0464 -15.5251 -15.2247 -15.1819 -14.8321 -14.6778 -14.6728 -14.4322 -14.2520 -14.0002 -13.8546 -13.8408 -13.5137 -13.4167 -13.3785 -12.9524 -12.8412 -12.3158 -12.2588 -12.1359 -12.0884 -12.0485 -11.6833 -11.4427 -11.1107 -10.8845 -10.8806 -10.8543 -10.6863 -9.6506 -9.1619 -9.0609 -2.6441 -0.4996 0.4818 0.7938 1.1955 1.3810 1.6800 1.8274 1.8909 1.9424 2.2676 electronvolt
chargesum: 1.0000000
charge: -0.204934 -0.565477 -0.581440 0.358087 0.442704 0.227317 -0.228746 0.204615 0.213867 -0.082557 0.536672 -0.790405 -0.794242 0.186929 -0.796750 0.243566 0.276396 0.252991 0.246697 0.270950 0.249358 0.242682 0.276855 0.253192 0.260940 0.232028 0.238558 0.553815 -0.506076 -0.500122 -0.196418 0.127342 -0.206478 0.129577 0.260362 0.177108 0.175910 1.167501 -0.675113 -0.677262
charge: 0.506194 -0.196881 -0.326824 0.064108 0.066558 0.100742 0.001705 0.039772 0.013382 0.067916 0.707228 -0.040463 -0.041483 -0.096677 -0.041575 -0.042947 -0.034507 -0.043424 -0.042929 -0.034462 -0.042465 -0.043166 -0.034503 -0.043114 0.055509 0.091751 0.053261 -0.096505 0.135090 0.134303 0.123132 0.040083 0.122905 0.040119 -0.062391 0.036591 0.036557 -0.336956 0.082249 0.082117
qa: -0.2049 -0.5655 -0.5814 0.3581 0.4427 0.2273 -0.2287 0.2046 0.2139 -0.0826 0.5367 -0.7904 -0.7942 0.1869 -0.7967 0.2436 0.2764 0.2530 0.2467 0.2709 0.2494 0.2427 0.2769 0.2532 0.2609 0.2320 0.2386 0.5538 -0.5061 -0.5001 -0.1964 0.1273 -0.2065 0.1296 0.2604 0.1771 0.1759 1.1675 -0.6751 -0.6773
va: 1.8173 3.0667 3.0689 2.5130 3.4439 0.9618 4.0819 0.9882 0.9777 4.3124 3.4798 3.9599 3.9924 1.0279 3.9933 1.0685 1.0540 1.0551 1.0581 1.0587 1.0559 1.0702 1.0540 1.0529 0.9289 0.9997 0.9542 -0.0811 3.0650 3.0781 3.1559 0.9896 3.1936 0.9980 3.0827 0.9510 0.9527 3.0368 1.4543 1.4503
dispcorr: -0.016863180 hartree
energy: -1265.844154915504
