program: Orca
programVersion: 6.0.x
elementType: Au C C C C H C H H C P C C H C H H H H H H H H H H H H C C C C H C H C H H C C C H H H H H
elementType: Au
charge: 1
multiplicity: 1
keywords: wB97X-D3 def2-TZVPPD autoaux TightSCF
formula: C18H25AuP
InChI: InChI=1/C15H16.C3H9P.Au/c1-11-2-3-15(10-11)14-8-6-13(7-9-14)12-4-5-12;1-4(2)3;/h1,6-9,12H,2-5,10H2;1-3H3;/rC18H25AuP/c1-20(2,3)19-13-14-4-5-18(12-14)17-10-8-16(9-11-17)15-6-7-15/h8-11,13,15H,4-7,12H2,1-3H3
45 atoms
Au -0.387061 -2.819924 0.154497
C  -1.140412 -0.91087 0.086089
C  -0.564256 0.181953 -0.437589
C  -0.001056 2.507648 -0.44311
C  -1.159577 1.580747 -0.449118
H  -1.662641 1.767294 -1.423484
C  0.79921 0.320508 -1.08274
H  0.707059 0.257824 -2.181289
H  1.508103 -0.455401 -0.763859
C  1.246433 1.732127 -0.685614
P  0.464069 -5.002396 0.248205
C  -0.679464 -6.283199 -0.361259
C  1.980023 -5.241373 -0.734236
H  -2.13987 -0.72454 0.514592
C  0.917273 -5.555297 1.924257
H  0.027419 -5.537523 2.570564
H  1.327937 -6.576165 1.900298
H  1.668572 -4.87184 2.346463
H  -1.602795 -6.267998 0.236169
H  -0.219316 -7.280614 -0.292486
H  -0.939156 -6.075033 -1.409585
H  1.772575 -5.015299 -1.790523
H  2.342043 -6.277234 -0.649614
H  2.761514 -4.554135 -0.378166
H  -1.91083 1.788152 0.326561
H  1.760493 1.713195 0.296676
H  1.937449 2.229186 -1.381178
C  -0.065966 3.897603 -0.232047
C  -1.310705 4.544458 0.008233
C  1.112427 4.697446 -0.250569
C  -1.366745 5.904626 0.213104
H  -2.234325 3.962991 0.028373
C  1.047961 6.055014 -0.037485
H  2.083286 4.231945 -0.430489
C  -0.193101 6.689692 0.198473
H  -2.329257 6.38878 0.392276
H  1.970711 6.639161 -0.052767
C  -0.3015 8.141489 0.431345
C  0.793229 8.893388 1.166966
C  0.614424 9.114858 -0.289086
H  -1.323083 8.486355 0.607992
H  1.657402 8.314528 1.505204
H  0.460467 9.6677 1.862635
H  0.154696 10.046466 -0.62833
H  1.352355 8.692275 -0.977017
totalener: -1178.02713969782917 hartree
nucrepener: 1652.61161646126243 hartree
electener: -2830.55187008354642 hartree
oneelecener: -4922.51330060942928 hartree
twoeener: 2091.96143052588286 hartree
cpcmener: -0.07651258287087 hartree
kineticenergy: 1083.01551608535510 hartree
energy: -2100.3428 -282.7863 -281.5838 -281.1142 -281.1100 -281.0179 -280.5713 -280.5602 -280.5444 -280.5436 -280.4971 -280.2506 -280.2421 -280.0440 -279.9636 -279.8510 -279.8448 -279.8424 -279.2564 -182.0432 -131.7493 -131.7487 -131.6701 -116.0272 -66.5849 -66.2254 -66.2173 -28.1429 -27.5559 -26.8535 -25.0989 -24.5751 -24.5029 -23.7419 -23.2555 -22.2249 -22.2201 -21.6593 -20.7457 -20.3286 -19.7118 -19.2535 -18.6291 -18.0994 -17.8428 -17.3725 -16.5578 -16.2930 -16.2058 -15.7003 -15.4729 -15.1625 -14.9698 -14.8417 -14.6483 -14.6403 -14.5187 -14.1676 -13.9574 -13.8206 -13.8157 -13.6101 -13.3529 -13.3487 -13.2160 -12.8297 -12.7961 -12.6537 -12.3294 -12.2141 -12.1962 -12.0214 -11.8297 -11.3778 -11.2927 -10.8370 -10.8146 -10.7732 -10.3441 -9.6933 -9.5955 -9.0448 -8.9110 -2.0203 0.8398 0.9518 1.2462 1.4741 1.7241 1.7488 1.9398 1.9591 2.2519 2.2811 electronvolt
chargesum: 1.0000000
charge: -0.219073 -0.613817 -0.538486 0.427144 0.386422 0.240796 -0.211836 0.207461 0.220091 -0.175489 0.514081 -0.782682 -0.793559 0.190502 -0.776907 0.245683 0.270920 0.245610 0.251248 0.268329 0.241903 0.246178 0.275571 0.253759 0.255041 0.245719 0.234593 0.583740 -0.593282 -1.154257 -0.464668 0.138059 -0.214259 0.109418 0.911142 0.129740 0.132736 0.179824 -0.440187 -0.431010 0.228894 0.186959 0.198699 0.201352 0.187899
charge: 0.501817 -0.203749 -0.332093 0.029748 0.055693 0.083108 -0.007399 0.037301 0.009559 0.056289 0.706854 -0.041129 -0.041947 -0.099628 -0.041926 -0.042730 -0.034859 -0.043659 -0.042791 -0.034701 -0.043126 -0.043304 -0.034825 -0.043458 0.049775 0.075431 0.047417 -0.126172 0.115147 0.117307 0.085708 0.036003 0.086161 0.035999 -0.087786 0.033152 0.029416 -0.114979 0.070900 0.071378 0.047013 0.018494 0.020751 0.020741 0.019097
qa: -0.2191 -0.6138 -0.5385 0.4271 0.3864 0.2408 -0.2118 0.2075 0.2201 -0.1755 0.5141 -0.7827 -0.7936 0.1905 -0.7769 0.2457 0.2709 0.2456 0.2512 0.2683 0.2419 0.2462 0.2756 0.2538 0.2550 0.2457 0.2346 0.5837 -0.5933 -1.1543 -0.4647 0.1381 -0.2143 0.1094 0.9111 0.1297 0.1327 0.1798 -0.4402 -0.4310 0.2289 0.1870 0.1987 0.2014 0.1879
va: 1.8157 3.1094 3.0813 2.2165 3.4494 0.9512 4.0501 0.9922 0.9701 4.3583 3.4999 3.9780 3.9749 1.0259 3.9983 1.0647 1.0560 1.0624 1.0537 1.0607 1.0684 1.0673 1.0575 1.0509 0.9465 0.9923 0.9746 -0.3748 2.4115 2.5756 2.8756 0.9867 2.9849 1.0295 1.0366 1.0181 0.9801 2.0889 3.8458 3.8430 0.9243 1.0253 1.0526 1.0504 1.0297
dispcorr: -0.018417455 hartree
energy: -1178.045557152861
