program: Orca
programVersion: 6.0.x
elementType: Au C C C C H C H H C P C C H C H H H H H H H H H H H H C C C C H C H C H H O H
elementType: Au
charge: 1
multiplicity: 1
keywords: wB97X-D3 def2-TZVPPD autoaux TightSCF
formula: C15H21AuOP
InChI: InChI=1/C12H12O.C3H9P.Au/c1-9-5-6-11(7-9)10-3-2-4-12(13)8-10;1-4(2)3;/h1-4,8,13H,5-7H2;1-3H3;/rC15H21AuOP/c1-18(2,3)16-11-12-7-8-14(9-12)13-5-4-6-15(17)10-13/h4-6,10-11,17H,7-9H2,1-3H3
39 atoms
Au -0.370836 -2.137485 0.01866
C  -0.959308 -0.175139 -0.11796
C  -0.212359 0.885509 -0.458737
C  0.473298 3.168468 -0.276029
C  -0.702589 2.320987 -0.551153
H  -0.949996 2.563497 -1.610708
C  1.266049 0.946964 -0.783954
H  1.418611 0.900056 -1.876385
H  1.8404 0.12768 -0.331445
C  1.692544 2.325612 -0.267295
P  0.269553 -4.388061 0.162525
C  -1.070012 -5.565186 -0.210624
C  1.61546 -4.849978 -0.975388
H  -2.014829 0.072263 0.0861
C  0.872949 -4.89576 1.805131
H  0.085112 -4.731311 2.554868
H  1.156417 -5.959244 1.804026
H  1.747477 -4.288058 2.080413
H  -1.897412 -5.415651 0.498505
H  -0.70939 -6.602132 -0.133507
H  -1.446475 -5.386968 -1.228532
H  1.307919 -4.649802 -2.012243
H  1.865199 -5.916661 -0.870361
H  2.507349 -4.245548 -0.753771
H  -1.599941 2.574629 0.031462
H  1.961697 2.270572 0.808992
H  2.552885 2.790948 -0.7686
C  0.44362 4.573673 -0.047174
C  -0.789898 5.266141 -0.068572
C  1.644408 5.282148 0.202029
C  -0.825846 6.638721 0.14798
H  -1.729891 4.744624 -0.255473
C  1.595135 6.648165 0.425887
H  2.602401 4.761327 0.221515
C  0.374483 7.323318 0.397333
H  2.512212 7.206651 0.622828
H  0.345269 8.403624 0.570338
O  -2.017899 7.253682 0.112322
H  -1.915065 8.201381 0.2820
totalener: -1136.54285097382785 hartree
nucrepener: 1456.81822399944326 hartree
electener: -2593.27160296116062 hartree
oneelecener: -4480.59185317287938 hartree
twoeener: 1887.32025021171876 hartree
cpcmener: -0.08208328797601 hartree
kineticenergy: 1041.98388172041382 hartree
energy: -2100.3564 -524.8529 -283.1595 -282.4059 -281.2682 -281.0669 -280.9892 -280.9834 -280.7374 -280.6820 -280.6343 -280.1127 -280.0428 -279.8594 -279.8540 -279.8483 -279.3090 -182.0568 -131.7626 -131.7624 -131.6840 -116.0501 -66.6086 -66.2484 -66.2400 -32.9701 -28.1835 -27.1905 -25.1722 -24.5204 -24.5097 -23.8082 -23.3218 -22.2342 -22.2262 -21.5389 -20.9015 -20.2134 -19.3303 -18.1397 -18.0834 -17.3842 -17.2365 -16.6262 -16.2703 -16.0700 -15.2617 -15.1863 -15.0743 -14.8095 -14.6557 -14.6494 -14.4877 -14.1920 -13.8321 -13.8251 -13.8071 -13.6661 -13.4078 -13.3557 -13.1603 -12.9440 -12.6661 -12.5665 -12.2376 -12.2258 -12.0668 -11.4012 -10.8560 -10.8326 -10.8055 -10.6045 -9.6185 -9.4594 -9.0934 -8.9729 -2.1650 0.8200 1.0719 1.2279 1.3721 1.6619 1.8019 1.8284 1.9316 2.3429 2.4177 electronvolt
chargesum: 1.0000000
charge: -0.204777 -0.607838 -0.586385 0.333733 0.507541 0.239544 -0.227054 0.207620 0.219262 -0.141999 0.531626 -0.786926 -0.798325 0.186395 -0.785464 0.244036 0.273327 0.246071 0.249882 0.269374 0.244395 0.245209 0.274041 0.256392 0.254757 0.237960 0.230651 0.676796 -0.632053 -0.605805 0.650936 0.070372 -0.285086 0.144215 -0.228060 0.232657 0.160312 -0.455605 0.158272
charge: 0.503824 -0.200787 -0.329366 0.051976 0.061147 0.091978 -0.002942 0.038331 0.011638 0.062155 0.707032 -0.041294 -0.041603 -0.098234 -0.041835 -0.042834 -0.034650 -0.043310 -0.042797 -0.034719 -0.043003 -0.043257 -0.034720 -0.043172 0.053801 0.082890 0.050568 -0.119106 0.161521 0.096714 -0.239096 0.042582 0.053809 0.031571 0.124850 0.029351 0.045104 0.294475 -0.118592
qa: -0.2048 -0.6078 -0.5864 0.3337 0.5075 0.2395 -0.2271 0.2076 0.2193 -0.1420 0.5316 -0.7869 -0.7983 0.1864 -0.7855 0.2440 0.2733 0.2461 0.2499 0.2694 0.2444 0.2452 0.2740 0.2564 0.2548 0.2380 0.2307 0.6768 -0.6321 -0.6058 0.6509 0.0704 -0.2851 0.1442 -0.2281 0.2327 0.1603 -0.4556 0.1583
va: 1.8080 3.0928 2.9439 2.6063 3.2594 0.9459 4.0567 0.9847 0.9832 4.3695 3.4842 3.9769 3.9781 1.0297 4.0006 1.0705 1.0549 1.0621 1.0528 1.0603 1.0645 1.0665 1.0587 1.0527 0.9417 0.9867 0.9757 0.5522 2.9681 2.8980 2.8631 1.0772 3.2131 1.0000 3.4001 0.9245 0.9479 1.8049 1.0184
dispcorr: -0.016111771 hartree
energy: -1136.558962744329
