program: Orca
programVersion: 6.0.x
elementType: C H H C C H C H H C C H H Au P C C C H H H H H H H H H C C C C H C H C H H C F F F
elementType: Au
charge: 1
multiplicity: 1
keywords: wB97X-D3 def2-TZVPPD autoaux TightSCF
formula: C16H20F3AuP
InChI: InChI=1/C13H11F3.C3H9P.Au/c1-3-4-6-10(2)11-7-5-8-12(9-11)13(14,15)16;1-4(2)3;/h1,5,7-9H,2,4,6H2;1-3H3;/rC16H20AuF3P/c1-12(8-9-15-11-17(15)21(2,3)4)13-6-5-7-14(10-13)16(18,19)20/h5-7,10-11H,1,8-9H2,2-4H3
41 atoms
C  -2.918493 -0.867826 -1.6905
H  -2.37491 -1.670385 -1.169133
H  -3.638056 -1.363184 -2.361398
C  -1.987529 -0.123135 -2.549147
C  -1.369217 0.579234 -3.351148
H  -1.044468 1.189237 -4.186137
C  -2.681237 2.143208 0.129464
H  -2.076406 2.755326 0.803349
H  -3.228893 2.673822 -0.65464
C  -2.783118 0.811024 0.248954
C  -3.671664 0.04359 -0.705095
H  -4.383111 -0.588455 -0.152195
H  -4.274112 0.760382 -1.280468
Au 0.189761 0.073932 -1.863265
P  2.167875 -0.238888 -0.702496
C  3.560481 -0.618585 -1.802818
C  2.683316 1.208236 0.260312
C  2.056932 -1.637937 0.447325
H  1.839303 -2.553696 -0.120897
H  3.009316 -1.757834 0.98435
H  1.247048 -1.466913 1.169321
H  3.340998 -1.530508 -2.376292
H  4.47282 -0.771814 -1.207072
H  3.719046 0.213017 -2.504233
H  2.885688 2.042083 -0.427286
H  3.594148 0.976922 0.831976
H  1.883279 1.507217 0.949674
C  -2.038439 0.05325 1.302435
C  -2.423701 -1.240157 1.681514
C  -0.937376 0.627131 1.960908
C  -1.751452 -1.930534 2.691525
H  -3.275206 -1.724002 1.198815
C  -0.279575 -0.056107 2.977702
H  -0.591262 1.622717 1.67954
C  -0.679694 -1.342936 3.351453
H  -2.077623 -2.935362 2.96954
H  -0.157048 -1.876828 4.148711
C  0.900891 0.564422 3.67753
F  1.055974 1.859395 3.376427
F  2.05239 -0.050065 3.351557
F  0.79024 0.478465 5.008734
totalener: -1398.41154789974394 hartree
nucrepener: 2142.89187996544979 hartree
electener: -3541.22124595214564 hartree
oneelecener: -6210.73441016325887 hartree
twoeener: 2669.51316421111324 hartree
cpcmener: -0.07877422877663 hartree
kineticenergy: 1303.14953715698744 hartree
energy: -2101.0457 -675.7794 -675.7008 -675.6690 -286.9331 -281.9021 -281.3598 -281.0514 -280.8956 -280.7925 -280.6494 -280.5732 -280.5258 -280.4297 -280.3784 -280.3698 -280.1633 -280.1491 -280.1425 -279.9151 -182.7341 -132.4305 -132.4283 -132.3890 -117.1833 -67.8111 -67.4321 -67.3335 -39.5122 -37.0355 -36.9275 -27.5622 -26.5529 -25.6942 -24.9459 -24.8079 -24.3279 -23.4814 -22.6542 -22.5884 -22.5433 -21.3929 -20.5507 -20.4294 -19.5046 -19.4186 -18.9630 -18.5240 -18.3752 -17.5582 -17.1164 -16.4252 -16.2936 -16.1639 -16.0595 -15.7751 -15.4899 -15.3731 -15.2833 -15.2338 -15.0054 -14.8052 -14.7552 -14.6586 -14.4537 -14.2922 -14.1612 -14.1454 -14.0584 -13.7443 -13.7046 -13.5166 -13.1745 -13.0980 -12.8052 -12.7952 -12.3461 -12.3084 -12.1301 -12.0238 -11.9427 -11.8985 -11.3247 -11.0000 -10.6739 -10.1739 -10.0281 -9.0770 0.0279 0.3891 0.7159 1.1792 1.3370 1.6604 1.7137 1.8681 2.0657 2.1326 2.2414 electronvolt
chargesum: 1.0000000
charge: 0.183270 0.272245 0.203718 -0.419963 -0.207491 0.197691 -0.492226 0.216069 0.162494 0.185728 -0.386049 0.230387 0.293791 -0.056058 0.693012 -0.858213 -0.608346 -0.585893 0.261399 0.285360 0.106782 0.260682 0.270026 0.268263 0.279287 0.269096 0.098987 0.515075 -0.320695 -0.205769 -0.646671 0.183726 0.419351 0.025335 -0.372292 0.223616 0.094692 0.957791 -0.344699 -0.305321 -0.348185
charge: -0.020494 0.028465 0.048135 -0.164657 0.089701 -0.030576 0.221583 -0.021220 -0.012191 -0.210278 -0.000038 0.028711 0.033887 0.688145 0.755093 -0.022616 -0.008648 -0.006155 -0.032577 -0.023075 -0.067101 -0.036846 -0.027348 -0.036487 -0.032299 -0.022525 -0.065222 -0.132573 0.065396 0.093033 0.042484 0.020717 -0.101972 0.018012 0.059877 0.023434 0.037604 -0.583581 0.133397 0.128793 0.142015
qa: 0.1833 0.2722 0.2037 -0.4200 -0.2075 0.1977 -0.4922 0.2161 0.1625 0.1857 -0.3860 0.2304 0.2938 -0.0561 0.6930 -0.8582 -0.6083 -0.5859 0.2614 0.2854 0.1068 0.2607 0.2700 0.2683 0.2793 0.2691 0.0990 0.5151 -0.3207 -0.2058 -0.6467 0.1837 0.4194 0.0253 -0.3723 0.2236 0.0947 0.9578 -0.3447 -0.3053 -0.3482
va: 3.8925 0.9120 1.0383 3.4711 3.6492 1.0110 3.7032 0.9397 1.0273 2.2727 4.1350 1.0042 0.9020 1.9342 3.6357 3.9375 4.0926 4.0822 1.0759 1.0370 1.1784 1.0498 1.0603 1.0346 1.0390 1.0502 1.1684 1.2881 2.9473 2.0618 3.2759 0.9063 2.3053 0.8925 3.2621 0.9453 1.1216 2.2556 0.8453 0.9190 0.7262
dispcorr: -0.025889479 hartree
energy: -1398.437437379004
