program: Orca
programVersion: 6.0.x
elementType: C H H C C H C H H C C H H Au P C C C H H H H H H H H H C C C C H C H C H H N C C H H C H H C H H H H
elementType: Au
charge: 1
multiplicity: 1
keywords: wB97X-D3 def2-TZVPPD autoaux TightSCF
formula: C19H28AuNP
InChI: InChI=1/C16H19N.C3H9P.Au/c1-3-4-7-14(2)15-8-10-16(11-9-15)17-12-5-6-13-17;1-4(2)3;/h1,8-11H,2,4-7,12-13H2;1-3H3;/rC19H28AuNP/c1-16(7-10-18-15-20(18)22(2,3)4)17-8-11-19(12-9-17)21-13-5-6-14-21/h8-9,11-12,15H,1,5-7,10,13-14H2,2-4H3
50 atoms
C  -2.745751 -1.46512 1.765431
H  -1.811813 -1.971896 1.481642
H  -3.513352 -2.251007 1.84444
C  -3.154528 -0.565518 0.67717
C  -3.651881 0.234186 -0.117445
H  -4.297178 0.893354 -0.685905
C  -2.226263 1.672575 3.504293
H  -1.61897 2.582031 3.532088
H  -3.259078 1.754294 3.856056
C  -1.732181 0.49934 3.080252
C  -2.600792 -0.740395 3.115694
H  -2.195429 -1.474232 3.831342
H  -3.598609 -0.46277 3.484603
Au -1.613759 -0.026875 -0.94667
P  0.230673 0.057541 -2.347351
C  -0.202827 -0.425853 -4.043189
C  0.945404 1.719945 -2.478588
C  1.591076 -1.039282 -1.859963
H  1.227134 -2.073554 -1.782821
H  2.388378 -0.986297 -2.616475
H  1.989681 -0.72572 -0.88576
H  -0.590444 -1.454671 -4.046669
H  0.688268 -0.369564 -4.686334
H  -0.97832 0.248179 -4.434332
H  0.193413 2.413025 -2.882336
H  1.821413 1.701571 -3.144296
H  1.24821 2.068681 -1.481393
C  -0.34974 0.371531 2.541574
C  0.386453 -0.817944 2.659757
C  0.277077 1.437747 1.875223
C  1.671955 -0.945798 2.147596
H  -0.047538 -1.679868 3.174559
C  1.564183 1.336132 1.364361
H  -0.263848 2.378575 1.738679
C  2.297232 0.13162 1.478921
H  2.194138 -1.897198 2.260393
H  2.005436 2.200092 0.864626
N  3.542013 0.00284 0.93196
C  4.185223 1.036049 0.131597
C  4.359565 -1.195969 1.062412
H  3.490634 1.446949 -0.619935
H  4.523235 1.880101 0.762681
C  5.362678 0.305584 -0.51226
H  4.413362 -1.531106 2.111153
H  3.936514 -2.03179 0.47131
C  5.721483 -0.759351 0.523954
H  5.03498 -0.173273 -1.449424
H  6.194943 0.981566 -0.753371
H  6.316968 -0.310669 1.335259
H  6.296728 -1.598572 0.108597
totalener: -1272.71820831883360 hartree
nucrepener: 2227.01667567661480 hartree
electener: -3499.65110712785599 hartree
oneelecener: -6194.01747774371961 hartree
twoeener: 2694.36637061586362 hartree
cpcmener: -0.07610133870651 hartree
kineticenergy: 1177.28789299307914 hartree
energy: -2101.0318 -393.0638 -281.8349 -281.3041 -281.2045 -280.9440 -280.6134 -280.6000 -280.3819 -280.2384 -280.1435 -280.1421 -280.1387 -280.0672 -280.0568 -279.9942 -279.8156 -279.8080 -279.7692 -279.7499 -279.5666 -182.7182 -132.4146 -132.4136 -132.3724 -117.1152 -67.7433 -67.3665 -67.2662 -29.5256 -26.9098 -26.3262 -25.4856 -24.9358 -24.7604 -23.9154 -23.7458 -23.2020 -22.7125 -22.5632 -22.5473 -21.1831 -20.4580 -19.8720 -18.8543 -18.7754 -18.5103 -18.2933 -17.9441 -17.5029 -16.6101 -16.5906 -16.0544 -15.5927 -15.5344 -15.4568 -15.0450 -15.0200 -14.9397 -14.6358 -14.4326 -14.3669 -14.2626 -14.2391 -14.1331 -14.0832 -14.0290 -13.7502 -13.5808 -13.4578 -13.1482 -13.0674 -12.9485 -12.7574 -12.5339 -12.3024 -12.1441 -12.1090 -12.0227 -11.9447 -11.8646 -11.8296 -11.6522 -11.5543 -11.1839 -10.9052 -10.6424 -10.1770 -9.6541 -9.5307 -7.4829 0.2262 0.9202 1.1148 1.2897 1.4527 1.6055 1.7795 1.8678 2.0378 2.1412 2.1901 electronvolt
chargesum: 1.0000000
charge: 0.167547 0.315161 0.214827 -0.380234 -0.254948 0.198376 -0.560964 0.236301 0.179699 -0.100952 -0.379753 0.215096 0.263457 -0.046330 0.559235 -0.859517 -0.719191 -0.446358 0.284079 0.304832 -0.043856 0.263391 0.271936 0.273356 0.282907 0.286058 0.205127 0.732517 -0.569791 -0.805962 -0.469055 0.157935 -0.364494 0.009807 1.224569 0.154761 0.196448 0.043216 -0.523362 -0.397200 0.047621 0.257568 -0.198914 0.215811 0.235292 -0.631616 0.203945 0.240957 0.267486 0.243178
charge: -0.023874 0.019852 0.045980 -0.159383 0.090447 -0.031669 0.200722 -0.024428 -0.021724 -0.224920 0.002525 0.033464 0.031068 0.686238 0.757068 -0.025021 -0.012607 0.003892 -0.029390 -0.022990 -0.073521 -0.037166 -0.028613 -0.037239 -0.034227 -0.024289 -0.062871 -0.191809 0.035328 0.021593 0.061750 0.023603 0.046308 0.019621 -0.216360 0.006391 0.003727 -0.046416 -0.011989 -0.013697 0.019203 0.045355 0.010909 0.035782 0.039761 0.010547 0.024112 0.024754 0.029449 0.024754
qa: 0.1675 0.3152 0.2148 -0.3802 -0.2549 0.1984 -0.5610 0.2363 0.1797 -0.1010 -0.3798 0.2151 0.2635 -0.0463 0.5592 -0.8595 -0.7192 -0.4464 0.2841 0.3048 -0.0439 0.2634 0.2719 0.2734 0.2829 0.2861 0.2051 0.7325 -0.5698 -0.8060 -0.4691 0.1579 -0.3645 0.0098 1.2246 0.1548 0.1964 0.0432 -0.5234 -0.3972 0.0476 0.2576 -0.1989 0.2158 0.2353 -0.6316 0.2039 0.2410 0.2675 0.2432
va: 3.7270 0.8356 1.0466 3.2900 3.7659 1.0208 3.5797 0.9227 1.0339 1.9689 3.9444 1.0213 0.9522 1.9416 3.5921 3.9214 4.0175 4.1824 1.0259 0.9886 1.7443 1.0496 1.0591 1.0365 1.0464 1.0282 1.0601 0.5137 2.4646 2.3748 2.7704 0.9621 3.1846 1.1340 1.1073 0.9125 0.8573 2.7048 4.3336 4.0645 1.2397 0.9150 3.7269 0.9745 0.9726 4.2531 1.0021 1.0249 0.9601 1.0145
dispcorr: -0.031354241 hartree
energy: -1272.749562559612
