program: Orca
programVersion: 6.0.x
elementType: C H H C C H C H H C C H H Au P C C C H H H H H H H H H C C C C H C H C N O O C F F F C F F F
elementType: Au
charge: 1
multiplicity: 1
keywords: wB97X-D3 def2-TZVPPD autoaux TightSCF
formula: C17H18F6AuNO2P
InChI: InChI=1/C14H9F6NO2.C3H9P.Au/c1-3-4-5-8(2)9-6-10(13(15,16)17)12(21(22)23)11(7-9)14(18,19)20;1-4(2)3;/h1,6-7H,2,4-5H2;1-3H3;/rC17H18AuF6NO2P/c1-10(5-6-12-9-18(12)28(2,3)4)11-7-13(16(19,20)21)15(25(26)27)14(8-11)17(22,23)24/h7-9H,1,5-6H2,2-4H3
46 atoms
C  -1.101576 -0.290485 3.49294
H  -0.558179 -1.069978 2.937302
H  -1.259684 -0.688816 4.507757
C  -2.434094 -0.119748 2.900134
C  -3.60238 0.09166 2.570999
H  -4.669594 0.277234 2.533451
C  -0.731826 2.83912 1.965656
H  -0.608446 3.389819 1.030477
H  -1.438095 3.260342 2.686284
C  -0.062093 1.713687 2.255231
C  -0.302371 1.023951 3.580284
H  0.649524 0.799655 4.085326
H  -0.845713 1.716122 4.237918
Au -2.622071 -0.228632 0.611182
P  -2.149185 -0.564969 -1.630866
C  -3.484101 -1.446682 -2.487823
C  -1.908887 0.977446 -2.553661
C  -0.659692 -1.572254 -1.87501
H  -0.813535 -2.561085 -1.419442
H  -0.455872 -1.691834 -2.949079
H  0.200536 -1.093078 -1.391108
H  -3.647964 -2.423562 -2.010963
H  -3.2112 -1.596982 -3.543219
H  -4.413083 -0.861516 -2.432027
H  -2.837106 1.565766 -2.517948
H  -1.658965 0.754432 -3.601269
H  -1.100751 1.56614 -2.100109
C  0.901295 1.099112 1.292084
C  1.700091 0.013384 1.665726
C  1.034848 1.57902 -0.018556
C  2.58898 -0.586571 0.776596
H  1.642357 -0.394881 2.674008
C  1.915097 1.002596 -0.924742
H  0.441447 2.428516 -0.355594
C  2.68946 -0.087096 -0.51897
N  3.592292 -0.738654 -1.485283
O  4.772394 -0.725408 -1.235211
O  3.079127 -1.242297 -2.456221
C  3.408877 -1.771397 1.253644
F  2.860531 -2.330132 2.334025
F  4.652163 -1.418924 1.578403
F  3.487175 -2.720955 0.314219
C  1.994321 1.56697 -2.330894
F  1.516197 2.810725 -2.378787
F  1.286572 0.842112 -3.20259
F  3.255689 1.605382 -2.771368
totalener: -1940.03354713101112 hartree
nucrepener: 3435.84777427412428 hartree
electener: -5375.78465523408977 hartree
oneelecener: -9533.36204522028675 hartree
twoeener: 4157.57738998619698 hartree
cpcmener: -0.09546611212064 hartree
kineticenergy: 1843.12587630489952 hartree
energy: -2101.0858 -676.0686 -676.0658 -676.0420 -676.0408 -675.9583 -675.9488 -525.2544 -525.2460 -400.1111 -287.4408 -287.4208 -282.7931 -281.9556 -281.8734 -281.8720 -281.4666 -281.4128 -281.2508 -281.2270 -281.1490 -280.9177 -280.5199 -280.2213 -280.1910 -280.1897 -280.1804 -182.7738 -132.4698 -132.4683 -132.4290 -117.2169 -67.8435 -67.4676 -67.3676 -39.9035 -39.8867 -38.1486 -37.3936 -37.3557 -37.3019 -37.2967 -33.2497 -28.7835 -26.9675 -26.2723 -26.1280 -25.2990 -24.9725 -24.2619 -23.8179 -23.0544 -22.6290 -22.5893 -22.5204 -21.6969 -21.2142 -20.9063 -20.1867 -19.9463 -19.8779 -19.8502 -19.6161 -19.0542 -18.8652 -18.5560 -18.4378 -18.3922 -17.9262 -17.7826 -17.0942 -16.9095 -16.4740 -16.4351 -16.3710 -16.2337 -16.0368 -15.9591 -15.5964 -15.5268 -15.3898 -15.3248 -15.2466 -15.1111 -15.0405 -14.9601 -14.8419 -14.7387 -14.7079 -14.5874 -14.4450 -14.3731 -14.2661 -14.1650 -14.1346 -13.8044 -13.6623 -13.3440 -13.1853 -12.8729 -12.7968 -12.4869 -12.3885 -12.3106 -12.1830 -12.1025 -12.0159 -11.9651 -11.9340 -11.4820 -11.1915 -10.8478 -10.7548 -10.2032 -9.4907 -0.9809 -0.0993 -0.0068 0.2679 1.0576 1.2871 1.5736 1.6607 1.7885 1.8442 2.0040 electronvolt
chargesum: 1.0000000
charge: 0.241332 0.220876 0.246194 -0.480664 -0.192883 0.188736 -0.353039 0.194927 0.145729 0.315131 -0.320764 0.212561 0.320878 -0.057759 0.646226 -0.856803 -0.631806 -0.472137 0.272255 0.294365 -0.022330 0.265762 0.270668 0.270954 0.277298 0.274629 0.140015 0.449447 -0.449705 -0.279420 0.166182 0.128322 -0.128694 0.111175 0.051629 1.274531 -0.695033 -0.675431 0.875650 -0.330918 -0.317284 -0.332763 0.714719 -0.352172 -0.271084 -0.349503
charge: -0.016963 0.029307 0.050238 -0.159415 0.091121 -0.029991 0.238231 -0.018141 -0.005526 -0.199894 0.006301 0.034650 0.035703 0.689017 0.758731 -0.021454 -0.008846 -0.002087 -0.029961 -0.020490 -0.067039 -0.036558 -0.026928 -0.036187 -0.032489 -0.023574 -0.061497 -0.088216 0.145185 0.131672 0.006465 0.030040 -0.012602 0.024754 -0.031303 -0.351381 0.116170 0.109331 -0.572933 0.153049 0.160739 0.155269 -0.573810 0.154725 0.146842 0.159747
qa: 0.2413 0.2209 0.2462 -0.4807 -0.1929 0.1887 -0.3530 0.1949 0.1457 0.3151 -0.3208 0.2126 0.3209 -0.0578 0.6462 -0.8568 -0.6318 -0.4721 0.2723 0.2944 -0.0223 0.2658 0.2707 0.2710 0.2773 0.2746 0.1400 0.4494 -0.4497 -0.2794 0.1662 0.1283 -0.1287 0.1112 0.0516 1.2745 -0.6950 -0.6754 0.8757 -0.3309 -0.3173 -0.3328 0.7147 -0.3522 -0.2711 -0.3495
va: 3.9103 0.9659 0.9763 3.4083 3.5897 1.0093 3.8111 0.9383 1.0218 2.5372 4.2249 1.0432 0.8675 1.9263 3.5880 3.9198 4.0392 4.2854 1.0646 1.0276 1.4476 1.0407 1.0593 1.0392 1.0503 1.0430 1.1608 1.3292 2.4439 1.5885 2.2655 0.8988 2.0927 0.6673 2.9002 3.2030 1.3645 1.4232 2.4624 0.8090 0.8099 0.7966 2.2548 0.7780 0.8809 0.6676
dispcorr: -0.032005616 hartree
energy: -1940.065552746549
