program: Gaussian 09
title: 000066144
version: EM64L-G09RevD.01
frameworkgroup: C1[X(C5H7BrO3)]
method: RPBEPBE
basis: SDD
operation: Freq
keyword: #p
keyword: freq=noraman
keyword: PBEPBE/SDD
title: #p freq=noraman PBEPBE/SDD
converged: YES YES NO NO
title: Mulliken charges:
elementType: Br O O O C C C C C H H H H H H H
charge: 0.033696 -0.270953 -0.184532 -0.111577 -0.230014 -0.668554 0.199586 0.190684 -0.742478 0.240386 0.240516 0.221997 0.232731 0.232588 0.308365 0.307557
chargesum: 0.00000
title: Mulliken charges with hydrogens summed into heavy atoms:
elementType: Br O O O C C C C C
charge: 0.033696 -0.270953 -0.184532 -0.111577 0.250888 0.018762 0.199586 0.190684 -0.126555
polarizability: 1.14485749e+02 2.38851692e+00 7.74582479e+01 -2.82315101e-01 -1.19823791e-01 4.39960810e+01
1716.lowfreq: -7.1581 -2.6390 -0.0009 -0.0008 -0.0004 6.0593 14.3991 47.3673 49.4231
frequency: 13.7246 47.3239 49.3646 81.8245 129.7767 169.3323 221.3273 242.0140 329.4042 347.8394 409.7112 433.1699 641.6335 646.6934 708.4045 791.8313 797.7749 841.4748 864.3556 1016.2667 1019.3747 1111.7939 1118.1858 1127.1057 1134.8321 1238.7719 1252.5228 1354.0403 1395.5409 1404.2414 1465.1208 1471.2682 1484.0368 1638.7468 1658.6608 2998.9344 3015.5871 3046.7023 3076.2138 3095.4373 3111.2091 3117.7774
redmass: 3.8567 3.5723 2.9664 4.9367 2.3291 12.1061 6.1490 1.2554 5.3012 7.3791 3.6907 5.6210 3.4182 6.2879 7.1639 4.8299 1.1028 5.8307 2.1369 2.4508 3.6545 2.6104 1.1517 4.5883 1.4541 1.4397 1.1324 1.3402 1.0963 1.2532 1.0396 1.0672 1.0637 11.8962 11.2261 1.0361 1.0582 1.0578 1.1068 1.0984 1.1032 1.1047
irintensity: 3.3245 3.8927 0.0279 0.1512 3.2687 1.0020 3.3961 0.3767 7.4008 4.6992 5.7260 5.4894 17.3863 68.8076 0.0751 6.4880 3.7164 19.0065 6.0687 132.1870 33.9083 49.6243 3.4038 184.9847 5.3854 30.1332 0.1392 8.3930 48.6960 19.8713 14.2351 4.8560 13.9431 227.2028 33.7364 15.4071 13.1739 12.6795 4.0524 24.4368 38.9561 0.0031
temp: 298.150 k
press: 1.00000 atm
elementType: 35 8 8 8 6 6 6 6 6 1 1 1 1 1 1 1
symmnumber: 1
zpe: 299780.3 jmol-1
zpe.correction: 0.114180 hartree
zpe.thermalcorrener: 0.124921 hartree
zpe.thermalcorrenthalpy: 0.125865 hartree
zpe.thermalcorrgfe: 0.073764 hartree
zpe.sumelectzpe: -433.138016 hartree
zpe.sumelectthermal: -433.127275 hartree
zpe.sumelectthermalent: -433.126331 hartree
zpe.sumelectthermalfe: -433.178432 hartree
dipole: -4.1434 -4.4857 0.0488
dipole: 6.1067
quadrupole: -55.1540 -72.4590 -59.5981
quadrupole: 5.5855 0.0655 0.0221
quadrupole: 7.2497 -10.0553 2.8056 5.5855 0.0655 0.0221
hfenergy: -433.252196 hartree
pointgroup: C01 [X(C5H7Br1O3)]
dipole: -1.9574606 -1.3911844 0.072953 debye
dipolederiv: -0.449634 0.2140398 0.0186229 0.1351127 -0.1345764 -0.0066206 0.0195944 -0.0114936 -0.0915014 -1.3609148 -0.4292258 0.0343075 -0.4873892 -0.8731563 0.0049561 0.0320968 0.0038009 -0.261428 -0.6194936 0.2885666 0.0201296 -0.0908905 -0.9124123 -0.0116118 0.0115296 -0.0278685 -0.2862236 -0.5351774 -0.2018227 0.012092 -0.062831 -0.6247195 0.0025282 0.0128942 0.0090994 -0.2430597 0.8917804 0.2121108 -0.0172896 0.140137 0.2835811 -0.0068703 -0.0185605 -0.0093272 0.3458099 -0.0762748 -0.0929935 0.0031022 -0.0780008 -0.059103 -0.0001126 0.0037449 0.0003549 0.0576791 1.0134595 0.0723738 -0.029459 0.6255328 1.3669337 0.0046262 -0.0189509 0.0264773 0.241572 0.5636129 0.189272 -0.0169438 -0.2352398 0.9934484 0.0102099 -0.0183863 -0.0089391 0.1576848 0.6914467 -0.313759 -0.0341956 -0.0759619 -0.353265 0.0037493 -0.0358534 0.0167258 0.0600181 -0.0477813 -0.0490844 -0.0039066 0.0224864 0.0092201 -0.0881912 0.0348795 -0.0853293 -0.0516011 -0.0497499 -0.0419329 0.001934 0.0321019 -0.0005115 0.0885736 -0.0330596 0.0912664 -0.0384099 -0.1560084 0.0031887 0.0117843 0.0161507 0.0756013 -0.0020248 0.0120584 -0.0014691 0.1219435 0.1185493 0.0445011 0.0628476 -0.0083303 0.0221481 -0.0785317 0.0409568 -0.100295 -0.0666161 0.1087242 0.056918 -0.0743103 0.0012342 0.0118088 0.0829639 -0.0554443 0.1003034 -0.0465932 -0.0524607 0.0220077 -0.0724533 0.0320083 0.0978441 -0.0172903 -0.0519379 -0.0354218 0.0581297 -0.0400781 0.0258397 0.083738 0.0338794 0.0971584 0.0136461 0.0644383 0.0321152 0.0425958 unknown
polarizability: 113.7342022|-5.2483516|78.0587183|-3.1784017|0.7488437|44.1471572 unknown
InChI: InChI=1S/C5H7BrO3/c1-2-9-5(8)4(7)3-6/h2-3H2,1H3
charge 0 multiplicity 1
16 atoms
Br 3.453033 -1.430603 -0.282747
O  -1.083904 -0.260205 -0.081165
O  -0.725242 2.050391 -0.041483
O  2.072297 1.405343 -0.198332
C  -2.57099 -0.039081 -0.014311
C  -3.227452 -1.413432 -0.02635
C  -0.292721 0.884323 -0.087181
C  1.217879 0.50097 -0.160557
C  1.50382 -0.996631 -0.177502
H  -2.783385 0.531514 0.907464
H  -2.856561 0.582169 -0.881973
H  -4.325262 -1.297296 0.022789
H  -2.980527 -1.964688 -0.949479
H  -2.905777 -2.016019 0.839917
H  1.016751 -1.471986 -1.044281
H  1.114041 -1.47237 0.737291
