program: Orca
programVersion: 6.0.x
elementType: C H H C C H C H H C C H H Au P C C C H H H H H H H H H C C C C H C H C H O H O H
elementType: Au
charge: 1
multiplicity: 1
keywords: wB97X-D3 def2-TZVPPD autoaux TightSCF
formula: C15H21AuO2P
InChI: InChI=1/C12H12O2.C3H9P.Au/c1-3-4-5-9(2)10-6-7-11(13)12(14)8-10;1-4(2)3;/h1,6-8,13-14H,2,4-5H2;1-3H3;/rC15H21AuO2P/c1-11(12-6-8-14(17)15(18)9-12)5-7-13-10-16(13)19(2,3)4/h6,8-10,17-18H,1,5,7H2,2-4H3
40 atoms
C  -2.904534 -0.970206 -0.372323
H  -2.160597 -1.67048 0.034095
H  -3.582391 -1.571194 -0.998275
C  -2.224433 -0.013432 -1.257495
C  -1.828294 0.868946 -2.020363
H  -1.716744 1.662854 -2.749497
C  -3.518027 2.019738 1.64106
H  -3.024645 2.819692 2.200799
H  -4.504493 2.24058 1.222439
C  -2.958149 0.811527 1.487897
C  -3.700543 -0.285793 0.7549
H  -4.005632 -1.077703 1.458382
H  -4.626716 0.136466 0.33962
Au 0.07961 0.059893 -1.22212
P  2.330115 -0.412618 -0.936487
C  3.087058 -0.903197 -2.512966
C  3.300288 0.999432 -0.341956
C  2.67709 -1.77393 0.21262
H  2.042949 -2.640158 -0.022047
H  3.735723 -2.060132 0.120054
H  2.487924 -1.448356 1.244831
H  2.607098 -1.820031 -2.884712
H  4.162162 -1.087735 -2.367685
H  2.951516 -0.105019 -3.256769
H  3.216015 1.830496 -1.057036
H  4.356976 0.708999 -0.242095
H  2.915462 1.329955 0.633551
C  -1.592714 0.510505 2.007365
C  -1.250344 -0.765411 2.471404
C  -0.602838 1.509852 2.016526
C  0.035899 -1.03938 2.938743
H  -1.995009 -1.564804 2.484877
C  0.674497 1.242054 2.487829
H  -0.823059 2.508921 1.628908
C  1.004833 -0.042828 2.95288
H  0.302016 -2.03501 3.301581
O  1.689167 2.14467 2.514653
H  1.39108 3.009601 2.199248
O  2.259816 -0.31484 3.371541
H  2.782695 0.50067 3.342614
totalener: -1211.77597605691335 hartree
nucrepener: 1836.55624223582254 hartree
electener: -3048.24863293731278 hartree
oneelecener: -5339.86366943339999 hartree
twoeener: 2291.61503649608721 hartree
cpcmener: -0.07989257066760 hartree
kineticenergy: 1117.03998930642001 hartree
energy: -2101.0342 -524.8283 -524.6074 -281.8646 -281.8537 -281.7878 -281.3238 -280.9770 -280.4984 -280.4142 -280.3097 -280.2175 -280.1396 -280.1228 -280.1221 -280.1194 -280.1035 -279.7174 -182.7199 -132.4162 -132.4150 -132.3746 -117.1190 -67.7468 -67.3720 -67.2704 -33.0944 -32.2910 -27.1004 -26.3545 -25.3803 -24.9228 -24.1611 -23.7413 -23.2225 -22.5502 -22.5374 -21.3089 -20.7603 -20.2559 -18.5147 -18.4824 -18.3561 -18.1291 -17.5211 -16.6222 -16.3779 -15.9528 -15.7031 -15.4948 -15.3547 -15.0077 -14.8514 -14.7677 -14.7195 -14.4497 -14.2357 -14.2084 -14.1074 -14.0274 -13.8391 -13.5673 -13.4731 -13.2124 -13.0611 -12.8016 -12.7139 -12.4832 -12.3061 -12.1746 -12.0897 -11.9739 -11.8506 -11.8134 -11.1130 -10.6750 -10.2594 -10.1661 -9.2448 -8.3265 0.2132 0.7616 1.1150 1.2279 1.3733 1.5169 1.7514 1.8470 1.9824 2.0210 2.1578 electronvolt
chargesum: 1.0000000
charge: 0.114203 0.311812 0.217868 -0.368406 -0.205509 0.193591 -0.565671 0.220104 0.183790 -0.180950 -0.401839 0.228984 0.261112 -0.036763 0.746177 -0.875319 -0.618283 -0.510117 0.223714 0.306145 0.019570 0.264545 0.274667 0.267210 0.254998 0.270867 0.076550 0.786931 -0.446416 -0.514473 -0.483780 0.246073 1.034876 -0.032423 0.359445 0.158796 -0.528242 0.111543 -0.565155 0.199775
charge: -0.022357 0.019418 0.045681 -0.158516 0.094371 -0.031150 0.210719 -0.019828 -0.018022 -0.218536 0.007232 0.035584 0.031745 0.691366 0.758753 -0.027421 -0.000522 0.002239 -0.031502 -0.023664 -0.070205 -0.036532 -0.029230 -0.038028 -0.030985 -0.021992 -0.069291 -0.178975 0.037084 0.087543 0.074234 0.024586 -0.217795 0.035691 -0.240924 0.033899 0.267923 -0.111719 0.276988 -0.137864
qa: 0.1142 0.3118 0.2179 -0.3684 -0.2055 0.1936 -0.5657 0.2201 0.1838 -0.1810 -0.4018 0.2290 0.2611 -0.0368 0.7462 -0.8753 -0.6183 -0.5101 0.2237 0.3061 0.0196 0.2645 0.2747 0.2672 0.2550 0.2709 0.0766 0.7869 -0.4464 -0.5145 -0.4838 0.2461 1.0349 -0.0324 0.3594 0.1588 -0.5282 0.1115 -0.5652 0.1998
va: 3.8148 0.8349 1.0390 3.2779 3.7120 1.0242 3.5838 0.9520 1.0319 1.9903 3.8919 1.0151 0.9441 1.9526 3.6578 3.9322 4.0733 3.9379 1.1054 1.0166 1.1847 1.0484 1.0462 1.0347 1.0668 1.0531 1.0765 1.2446 3.0207 3.0182 3.1146 0.8606 2.2669 1.0619 2.7558 1.0067 1.6667 1.0583 1.5856 0.9945
dispcorr: -0.025302053 hartree
energy: -1211.801278110344
