program: Orca
programVersion: 6.0.x
elementType: C H H C C H C H H C C H H Au P C C C H H H H H H H H H C C C C H C H C H H C H H H
elementType: Au
charge: 1
multiplicity: 1
keywords: wB97X-D3 def2-TZVPPD autoaux TightSCF
formula: C16H23AuP
InChI: InChI=1/C13H14.C3H9P.Au/c1-4-5-8-12(3)13-9-6-7-11(2)10-13;1-4(2)3;/h1,6-7,9-10H,3,5,8H2,2H3;1-3H3;/rC16H23AuP/c1-13-7-6-8-15(11-13)14(2)9-10-16-12-17(16)18(3,4)5/h6-8,11-12H,2,9-10H2,1,3-5H3
41 atoms
C  -2.70114 -1.031219 1.276063
H  -1.868202 -1.750486 1.276894
H  -3.622786 -1.617821 1.417229
C  -2.803623 -0.407004 -0.049566
C  -3.067343 0.172158 -1.105044
H  -3.542937 0.643978 -1.956855
C  -1.479747 2.188917 2.083696
H  -0.633849 2.87965 2.040823
H  -2.474203 2.621712 1.94084
C  -1.333621 0.877128 2.325977
C  -2.563016 -0.001313 2.411125
H  -2.574149 -0.559616 3.359683
H  -3.457131 0.637995 2.416062
Au -0.867535 -0.033439 -1.221894
P  1.346969 -0.086996 -1.895872
C  1.51609 -0.489736 -3.657755
C  2.219311 1.485497 -1.66579
C  2.296629 -1.350361 -1.005367
H  1.859382 -2.339858 -1.201793
H  3.343857 -1.339872 -1.342401
H  2.253266 -1.154426 0.075348
H  1.063209 -1.47128 -3.857983
H  2.581115 -0.515456 -3.93318
H  1.001263 0.270328 -4.262592
H  1.728905 2.264759 -2.266762
H  3.267891 1.384421 -1.983063
H  2.181056 1.779951 -0.608226
C  0.011081 0.247674 2.515692
C  0.146203 -1.002454 3.135886
C  1.183089 0.901112 2.092905
C  1.407918 -1.565295 3.333626
H  -0.732746 -1.546053 3.488743
C  2.453826 0.359388 2.297263
H  1.10765 1.867846 1.587959
C  2.553726 -0.89191 2.923719
H  1.492705 -2.539161 3.823069
H  3.539014 -1.338858 3.086639
C  3.69115 1.079576 1.828875
H  4.091071 0.621047 0.909178
H  3.486556 2.138006 1.614151
H  4.488897 1.030808 2.584966
totalener: -1100.61797484777389 hartree
nucrepener: 1653.74563931277112 hartree
electener: -2754.28277747846823 hartree
oneelecener: -4820.86469386408316 hartree
twoeener: 2066.58191638561493 hartree
cpcmener: -0.07568150434450 hartree
kineticenergy: 1006.11653631861020 hartree
energy: -2101.0391 -281.8777 -281.3307 -281.0022 -280.5385 -280.4809 -280.3631 -280.2994 -280.1626 -280.1523 -280.1474 -280.0754 -280.0373 -280.0064 -279.9729 -279.7989 -279.6952 -182.7275 -132.4239 -132.4221 -132.3820 -117.1573 -67.7853 -67.4059 -67.3083 -27.1302 -26.4259 -25.4984 -24.9406 -24.3813 -24.1325 -23.2097 -22.5832 -22.5597 -21.9866 -21.2246 -20.0565 -19.1632 -18.5169 -18.3547 -17.7574 -17.0647 -16.2665 -16.0734 -15.7099 -15.4452 -15.2489 -15.1159 -15.0384 -14.8510 -14.6466 -14.3254 -14.2096 -14.1616 -14.1279 -13.9481 -13.6571 -13.6105 -13.1648 -13.1291 -12.9515 -12.8165 -12.7703 -12.6277 -12.2928 -12.0425 -11.9463 -11.9072 -11.8598 -11.7395 -11.2297 -10.8393 -10.6033 -10.1101 -9.3731 -8.8058 0.1138 0.5376 1.0310 1.3378 1.4796 1.6557 1.7461 1.9026 2.1430 2.2035 2.3065 electronvolt
chargesum: 1.0000000
charge: 0.171959 0.271108 0.211471 -0.406680 -0.219127 0.196322 -0.515590 0.225589 0.162615 0.126093 -0.362319 0.224555 0.295554 -0.056295 0.681992 -0.849914 -0.636556 -0.587720 0.265639 0.276976 0.096835 0.261887 0.269639 0.266186 0.276612 0.269207 0.129722 0.460220 -0.250200 -0.032139 -0.676326 0.176126 0.193935 -0.024610 0.079503 0.228229 0.145599 -1.054570 0.169410 0.233693 0.305370
charge: -0.022112 0.027149 0.048088 -0.162477 0.088127 -0.031268 0.212860 -0.025071 -0.015042 -0.214979 -0.002514 0.028326 0.032915 0.687010 0.753110 -0.023513 -0.009247 -0.003907 -0.032528 -0.022996 -0.066670 -0.036999 -0.027845 -0.036797 -0.033220 -0.023159 -0.064168 -0.152017 0.038752 0.052146 0.017482 0.014423 -0.219289 0.009969 0.022884 0.017087 0.026152 0.153408 -0.004022 -0.001672 0.001624
qa: 0.1720 0.2711 0.2115 -0.4067 -0.2191 0.1963 -0.5156 0.2256 0.1626 0.1261 -0.3623 0.2246 0.2956 -0.0563 0.6820 -0.8499 -0.6366 -0.5877 0.2656 0.2770 0.0968 0.2619 0.2696 0.2662 0.2766 0.2692 0.1297 0.4602 -0.2502 -0.0321 -0.6763 0.1761 0.1939 -0.0246 0.0795 0.2282 0.1456 -1.0546 0.1694 0.2337 0.3054
va: 3.9100 0.9069 1.0279 3.4682 3.6205 1.0091 3.7030 0.9304 1.0283 2.3627 4.0563 1.0105 0.9019 1.9388 3.6545 3.9431 4.0926 4.0693 1.0638 1.0485 1.2345 1.0455 1.0575 1.0373 1.0439 1.0610 1.1612 1.3660 2.7698 2.2054 3.2055 0.9137 1.7975 0.8570 3.0488 0.9238 1.0366 3.5399 1.0456 1.0014 0.9314
dispcorr: -0.024729895 hartree
energy: -1100.642704743265
