program: Orca
programVersion: 6.0.x
elementType: C H H C C H C H H C C H H Au P C C C H H H H H H H H H C C C C H C H C H H C H H H
elementType: Au
charge: 1
multiplicity: 1
keywords: wB97X-D3 def2-TZVPPD autoaux TightSCF
formula: C16H23AuP
InChI: InChI=1/C13H14.C3H9P.Au/c1-4-5-6-12(3)13-9-7-11(2)8-10-13;1-4(2)3;/h1,7-10H,3,5-6H2,2H3;1-3H3;/rC16H23AuP/c1-13-6-9-15(10-7-13)14(2)8-11-16-12-17(16)18(3,4)5/h6-7,9-10,12H,2,8,11H2,1,3-5H3
41 atoms
C  -2.785996 -1.188499 0.366241
H  -1.89597 -1.755169 0.678575
H  -3.546278 -1.933396 0.083506
C  -2.471284 -0.414603 -0.84353
C  -2.405051 0.279364 -1.859929
H  -2.597663 0.863377 -2.752293
C  -2.838681 2.101691 1.808519
H  -2.218911 2.950348 2.111876
H  -3.846357 2.326922 1.446632
C  -2.404999 0.835934 1.895516
C  -3.317126 -0.307375 1.510126
H  -3.492227 -0.969646 2.372935
H  -4.297052 0.100161 1.223475
Au -0.271626 -0.009367 -1.346634
P  2.043786 -0.069381 -1.372093
C  2.692337 -0.57805 -2.989197
C  2.821057 1.528614 -1.009506
C  2.719286 -1.251081 -0.172728
H  2.348462 -2.260472 -0.401004
H  3.818468 -1.243986 -0.221784
H  2.39579 -0.972743 0.840216
H  2.3086 -1.575918 -3.245336
H  3.791836 -0.606376 -2.957289
H  2.368558 0.136603 -3.759327
H  2.495552 2.273009 -1.750061
H  3.916093 1.428359 -1.047652
H  2.519365 1.866633 -0.008423
C  -1.022081 0.514238 2.357789
C  -0.735757 -0.677832 3.040847
C  0.042603 1.399539 2.126221
C  0.552312 -0.959428 3.491181
H  -1.531219 -1.400382 3.241289
C  1.326827 1.118966 2.586353
H  -0.132862 2.321723 1.56561
C  1.608625 -0.064731 3.279875
H  0.738825 -1.897399 4.022727
H  2.13249 1.834064 2.39383
C  2.99519 -0.364755 3.783746
H  3.089348 -0.104885 4.850986
H  3.234814 -1.434301 3.688624
H  3.755898 0.210559 3.236459
totalener: -1100.61801966752955 hartree
nucrepener: 1642.17104485486379 hartree
electener: -2742.70904799320306 hartree
oneelecener: -4797.91027237625531 hartree
twoeener: 2055.20122438305225 hartree
cpcmener: -0.07518197038583 hartree
kineticenergy: 1006.11512859586662 hartree
energy: -2101.0408 -281.8738 -281.3362 -280.9901 -280.4801 -280.3770 -280.3507 -280.2969 -280.1595 -280.1560 -280.1556 -280.1065 -280.1018 -280.0012 -279.9937 -279.7359 -279.6793 -182.7289 -132.4252 -132.4239 -132.3833 -117.1595 -67.7881 -67.4083 -67.3098 -27.1250 -26.4202 -25.5156 -24.9420 -24.3772 -23.7908 -23.5788 -22.5756 -22.5625 -21.8820 -21.2676 -19.6824 -19.4376 -18.5157 -18.3633 -17.9977 -16.8610 -16.2000 -15.9100 -15.6932 -15.4782 -15.2438 -15.0767 -15.0023 -14.8156 -14.6022 -14.3516 -14.2534 -14.2216 -14.1511 -14.0947 -13.6937 -13.6236 -13.2045 -13.1005 -12.9184 -12.7942 -12.7380 -12.5594 -12.3098 -12.0574 -11.9616 -11.9069 -11.8540 -11.7406 -11.1816 -10.7021 -10.4689 -10.1903 -9.5908 -8.6983 0.1736 0.6600 1.0126 1.2751 1.4500 1.6410 1.7502 1.8816 2.0857 2.2124 2.2718 electronvolt
chargesum: 1.0000000
charge: 0.191597 0.287777 0.211156 -0.403875 -0.228471 0.199492 -0.537017 0.236656 0.178682 0.016153 -0.363709 0.224247 0.274164 -0.051950 0.688917 -0.853829 -0.707030 -0.571634 0.254068 0.291858 0.055977 0.260300 0.269305 0.266034 0.257554 0.277733 0.196950 0.627837 -0.313289 -0.610966 -0.441939 0.170780 -0.235741 0.098918 0.933422 0.148303 0.097886 -1.170365 0.296507 0.236984 0.240558
charge: -0.022070 0.024278 0.046625 -0.163080 0.089635 -0.031079 0.212090 -0.021053 -0.017088 -0.218233 0.001911 0.031141 0.032745 0.685881 0.749037 -0.024888 -0.009408 -0.002137 -0.031801 -0.023006 -0.065083 -0.037151 -0.028348 -0.036796 -0.033721 -0.025139 -0.058617 -0.170832 0.048413 0.027282 0.041529 0.021576 0.020537 0.017398 -0.227904 0.026033 0.019955 0.149892 0.004484 -0.000164 -0.002843
qa: 0.1916 0.2878 0.2112 -0.4039 -0.2285 0.1995 -0.5370 0.2367 0.1787 0.0162 -0.3637 0.2242 0.2742 -0.0519 0.6889 -0.8538 -0.7070 -0.5716 0.2541 0.2919 0.0560 0.2603 0.2693 0.2660 0.2576 0.2777 0.1970 0.6278 -0.3133 -0.6110 -0.4419 0.1708 -0.2357 0.0989 0.9334 0.1483 0.0979 -1.1704 0.2965 0.2370 0.2406
va: 3.7570 0.8683 1.0354 3.3691 3.7655 1.0155 3.6002 0.9164 1.0312 2.0302 3.9770 1.0124 0.9377 1.9603 3.6482 3.9280 4.0116 4.0790 1.0779 1.0387 1.3627 1.0460 1.0598 1.0401 1.0612 1.0521 1.0886 1.0107 2.7759 2.8652 3.0432 0.9194 3.3676 1.0553 1.6276 0.9868 1.0068 3.4468 0.9546 0.9991 0.9963
dispcorr: -0.024005221 hartree
energy: -1100.642024888644
