program: Orca
programVersion: 6.0.x
elementType: Au C C C C H C H H C P C C H C H H H H H H H H H H H H C C C C H C H C H H C F F F
elementType: Au
keywords: opt freq wb97x-d3 def2-svp autoaux tightscf
charge: 1
multiplicity: 1
frequency: 0.00 0.00 0.00 0.00 0.00 0.00 5.62 14.11 22.23 23.69 38.56 54.73 67.36 82.68 99.73 134.35 153.36 160.40 177.97 188.38 189.74 191.25 225.57 233.56 238.65 242.12 266.02 270.05 285.14 331.45 356.24 390.53 402.06 407.42 452.46 461.56 473.86 529.32 579.02 592.71 610.66 619.40 639.72 694.96 697.80 712.57 761.28 763.00 776.47 797.75 800.98 838.11 847.74 859.80 861.53 862.81 870.82 882.67 899.93 958.71 960.47 962.38 968.72 995.45 1020.21 1029.32 1032.12 1035.42 1103.00 1105.10 1110.44 1136.27 1148.72 1207.06 1209.93 1212.31 1231.56 1254.05 1264.91 1282.81 1304.79 1305.05 1306.95 1316.19 1320.21 1331.60 1337.92 1361.28 1374.69 1395.31 1414.12 1415.86 1416.63 1424.66 1424.69 1430.13 1442.73 1465.44 1480.36 1569.66 1653.61 1712.18 1734.09 2972.77 3015.79 3068.10 3069.70 3070.26 3072.08 3103.62 3155.81 3156.33 3164.41 3185.07 3185.84 3186.45 3190.97 3191.60 3192.34 3241.15 3248.78 3256.93 3260.02
frequency: 5.62 14.11 22.23 23.69 38.56 54.73 67.36 82.68 99.73 134.35 153.36 160.40 177.97 188.38 189.74 191.25 225.57 233.56 238.65 242.12 266.02 270.05 285.14 331.45 356.24 390.53 402.06 407.42 452.46 461.56 473.86 529.32 579.02 592.71 610.66 619.40 639.72 694.96 697.80 712.57 761.28 763.00 776.47 797.75 800.98 838.11 847.74 859.80 861.53 862.81 870.82 882.67 899.93 958.71 960.47 962.38 968.72 995.45 1020.21 1029.32 1032.12 1035.42 1103.00 1105.10 1110.44 1136.27 1148.72 1207.06 1209.93 1212.31 1231.56 1254.05 1264.91 1282.81 1304.79 1305.05 1306.95 1316.19 1320.21 1331.60 1337.92 1361.28 1374.69 1395.31 1414.12 1415.86 1416.63 1424.66 1424.69 1430.13 1442.73 1465.44 1480.36 1569.66 1653.61 1712.18 1734.09 2972.77 3015.79 3068.10 3069.70 3070.26 3072.08 3103.62 3155.81 3156.33 3164.41 3185.07 3185.84 3186.45 3190.97 3191.60 3192.34 3241.15 3248.78 3256.93 3260.02
formula: C16H20F3AuP
InChI: InChI=1/C13H11F3.C3H9P.Au/c1-9-2-3-11(8-9)10-4-6-12(7-5-10)13(14,15)16;1-4(2)3;/h1,4-7H,2-3,8H2;1-3H3;/rC16H20AuF3P/c1-21(2,3)17-11-12-4-5-14(10-12)13-6-8-15(9-7-13)16(18,19)20/h6-9,11H,4-5,10H2,1-3H3
41 atoms
Au -0.371208 -3.154413 -0.079715
C  -1.025197 -1.22329 -0.322674
C  -0.297522 -0.140666 -0.633696
C  0.282529 2.168711 -0.447271
C  -0.836001 1.27273 -0.784006
H  -1.009161 1.492093 -1.864501
C  1.196073 -0.024306 -0.859914
H  1.425445 -0.085399 -1.938028
H  1.771326 -0.809048 -0.351089
C  1.529422 1.380576 -0.34736
P  0.3445 -5.367731 0.208658
C  -1.012371 -6.577019 0.336237
C  1.392744 -5.996662 -1.142361
H  -2.100988 -1.014082 -0.197406
C  1.334695 -5.640794 1.71382
H  0.7417 -5.367773 2.599017
H  1.638519 -6.695694 1.792593
H  2.233069 -5.006716 1.686666
H  -1.654504 -6.320626 1.191729
H  -0.614375 -7.593942 0.473423
H  -1.621958 -6.547234 -0.578782
H  0.840713 -5.946889 -2.09237
H  1.689367 -7.03893 -0.949902
H  2.294853 -5.373457 -1.228888
H  -1.785001 1.500555 -0.277611
H  1.724195 1.359664 0.747226
H  2.403076 1.874863 -0.795855
C  0.181876 3.579753 -0.238134
C  -1.068735 4.229871 -0.345555
C  1.331428 4.341434 0.080611
C  -1.166668 5.597546 -0.146475
H  -1.968311 3.662814 -0.589222
C  1.229435 5.705215 0.288258
H  2.306893 3.861075 0.169698
C  -0.018606 6.326044 0.169173
H  -2.133025 6.096273 -0.231095
H  2.11599 6.290106 0.540331
C  -0.100132 7.826842 0.356993
F  0.620831 8.223381 1.408576
F  0.379169 8.46289 -0.71717
F  -1.352348 8.242976 0.5448
totalener: -1397.25157114075569 hartree
nucrepener: 1828.48324472945410 hartree
electener: -3225.64364272213470 hartree
oneelecener: -5581.50051211063055 hartree
twoeener: 2355.85686938849585 hartree
cpcmener: -0.08493668393429 hartree
kineticenergy: 1297.02260173601439 hartree
temp: 298.15 k
press: 1.00 atm
thermalcorrenthalpy: 0.00094421 hartree
totalenthalpy: -1396.92352383 hartree
totalentropycorr: -0.07020727 hartree
gibbsenthalpy: -1396.99373109 hartree
gibbsminuselec: 0.27519598 hartree
totalenthalpy: -1396.93007734 hartree
totalenthalpy: -1396.92913189 hartree
totalenthalpy: -1396.92808449 hartree
energy: -2100.4060 -676.1430 -676.0781 -676.0250 -287.4637 -283.6931 -282.0873 -281.8115 -281.7699 -281.7517 -281.4238 -281.4228 -281.1654 -281.1241 -280.4735 -280.4647 -280.3078 -280.3051 -280.2996 -279.7136 -182.4180 -132.2553 -132.2552 -132.1727 -116.0636 -66.6800 -66.2322 -66.2226 -39.2987 -36.6933 -36.5988 -28.3714 -27.5228 -25.6912 -24.7798 -24.5084 -23.9665 -23.7152 -22.5891 -22.1055 -22.0986 -21.4411 -20.9705 -20.5132 -19.6550 -19.5244 -19.3143 -18.8614 -18.1455 -18.0186 -16.9770 -16.7077 -16.3622 -16.2684 -16.1075 -15.8821 -15.5267 -15.3700 -15.2556 -15.2150 -14.9108 -14.8520 -14.7194 -14.7139 -14.4920 -14.3266 -14.2396 -14.0611 -13.8670 -13.8559 -13.6427 -13.4098 -13.3938 -13.2011 -12.9109 -12.7933 -12.3299 -12.2925 -12.1607 -11.4397 -10.9808 -10.8557 -10.8137 -10.8030 -10.6179 -9.6724 -9.1501 -9.0302 -2.4315 0.7067 0.8879 1.3226 1.4114 2.7860 3.0522 3.5319 3.9015 4.1892 4.2363 electronvolt
chargesum: 1.0000000
charge: -0.054892 -0.309396 -0.224263 -0.103908 0.140875 0.148829 0.073463 0.076518 0.072345 0.008901 0.089754 -0.176722 -0.178011 0.036906 -0.178166 0.098666 0.087017 0.097306 0.098742 0.086810 0.099021 0.099195 0.087095 0.097322 0.116578 0.140437 0.118168 0.031104 0.012079 0.012317 0.010044 0.085706 0.009451 0.084178 -0.139974 0.074751 0.078972 0.609928 -0.174758 -0.175556 -0.166832
charge: -0.324658 -0.244631 -0.053258 0.264921 -0.024180 0.114615 -0.017470 0.048585 0.052342 -0.024602 0.734468 -0.188448 -0.189045 0.039495 -0.188957 0.051957 0.043586 0.051480 0.052220 0.043672 0.052259 0.052095 0.043648 0.051575 0.074818 0.106061 0.073801 -0.068418 0.069436 0.065896 -0.001381 0.064520 0.000999 0.064039 -0.024241 0.060420 0.062515 0.177018 -0.056014 -0.060791 -0.050344
qa: -0.0549 -0.3094 -0.2243 -0.1039 0.1409 0.1488 0.0735 0.0765 0.0723 0.0089 0.0898 -0.1767 -0.1780 0.0369 -0.1782 0.0987 0.0870 0.0973 0.0987 0.0868 0.0990 0.0992 0.0871 0.0973 0.1166 0.1404 0.1182 0.0311 0.0121 0.0123 0.0100 0.0857 0.0095 0.0842 -0.1400 0.0748 0.0790 0.6099 -0.1748 -0.1756 -0.1668
va: 1.6356 3.8492 4.1444 3.8598 3.7985 0.9763 3.9425 0.9779 0.9861 3.9741 4.0920 3.8962 3.8960 0.9672 3.8956 0.9845 0.9899 0.9850 0.9850 0.9902 0.9848 0.9843 0.9900 0.9852 0.9914 0.9730 0.9799 3.7484 3.8758 3.8748 3.9202 0.9905 3.9215 0.9910 3.7499 1.0004 0.9956 4.3870 1.1751 1.1737 1.1937
dispcorr: -0.017377984 hartree
energy: -1397.276722842485
zeropoint: 0.32417192 hartree
thermalvibcorrection: 0.02065307 hartree
thermalrotcorrection: 0.00141627 hartree
thermaltrasncorrection: 0.00141627 hartree
thermaltotal: -1396.92906531 hartree
thermalcorr: 0.02348561 hartree
nonthermalcorr: 0.32417192 hartree
totalcorr: 0.34765753 hartree
totalenthalpy: -1396.92812110 hartree
