program: Orca
programVersion: 6.0.x
elementType: Au C C C C H C H H C P C C H C H H H H H H H H H H H H C C C C H C H C H H C F F F
elementType: Au
keywords: opt freq wb97x-d3 def2-svp autoaux tightscf
charge: 1
multiplicity: 1
frequency: 0.00 0.00 0.00 0.00 0.00 0.00 9.85 17.07 24.61 27.00 30.89 47.47 69.46 89.38 116.43 136.17 148.70 151.49 170.30 175.70 181.07 192.84 214.99 219.07 236.11 253.53 264.03 268.65 286.35 320.83 355.40 367.75 375.00 417.55 420.54 468.46 473.80 531.04 576.31 597.09 618.62 649.00 656.16 687.70 695.12 700.18 714.49 762.43 763.02 795.02 805.80 831.44 850.12 853.78 859.50 861.46 876.91 895.90 957.42 958.22 961.62 967.75 969.54 1002.85 1008.26 1016.35 1029.35 1055.82 1102.96 1108.73 1115.91 1135.32 1144.64 1194.05 1204.72 1207.31 1227.10 1236.63 1255.08 1280.90 1303.17 1303.69 1304.55 1317.24 1318.67 1328.52 1340.68 1363.12 1372.36 1406.41 1412.77 1415.49 1415.98 1422.98 1423.68 1429.51 1442.39 1451.76 1516.94 1553.03 1664.76 1704.30 1736.21 2978.25 3019.08 3068.04 3069.43 3069.65 3072.02 3103.23 3155.85 3156.95 3164.73 3185.12 3185.94 3186.29 3191.03 3191.67 3192.17 3230.12 3245.20 3255.94 3258.60
frequency: 9.85 17.07 24.61 27.00 30.89 47.47 69.46 89.38 116.43 136.17 148.70 151.49 170.30 175.70 181.07 192.84 214.99 219.07 236.11 253.53 264.03 268.65 286.35 320.83 355.40 367.75 375.00 417.55 420.54 468.46 473.80 531.04 576.31 597.09 618.62 649.00 656.16 687.70 695.12 700.18 714.49 762.43 763.02 795.02 805.80 831.44 850.12 853.78 859.50 861.46 876.91 895.90 957.42 958.22 961.62 967.75 969.54 1002.85 1008.26 1016.35 1029.35 1055.82 1102.96 1108.73 1115.91 1135.32 1144.64 1194.05 1204.72 1207.31 1227.10 1236.63 1255.08 1280.90 1303.17 1303.69 1304.55 1317.24 1318.67 1328.52 1340.68 1363.12 1372.36 1406.41 1412.77 1415.49 1415.98 1422.98 1423.68 1429.51 1442.39 1451.76 1516.94 1553.03 1664.76 1704.30 1736.21 2978.25 3019.08 3068.04 3069.43 3069.65 3072.02 3103.23 3155.85 3156.95 3164.73 3185.12 3185.94 3186.29 3191.03 3191.67 3192.17 3230.12 3245.20 3255.94 3258.60
formula: C16H20F3AuP
InChI: InChI=1/C13H11F3.C3H9P.Au/c1-9-5-6-11(7-9)10-3-2-4-12(8-10)13(14,15)16;1-4(2)3;/h1-4,8H,5-7H2;1-3H3;/rC16H20AuF3P/c1-21(2,3)17-11-12-7-8-14(9-12)13-5-4-6-15(10-13)16(18,19)20/h4-6,10-11H,7-9H2,1-3H3
41 atoms
Au -0.376958 -2.895463 -0.006576
C  -0.771102 -0.888414 -0.184789
C  0.081758 0.095127 -0.506802
C  0.968128 2.303158 -0.297693
C  -0.270499 1.569986 -0.612706
H  -0.453234 1.834737 -1.680772
C  1.569093 0.019625 -0.786773
H  1.75108 -0.042869 -1.873846
H  2.052727 -0.846998 -0.316907
C  2.103107 1.354228 -0.255637
P  0.041049 -5.192709 0.200462
C  -1.378845 -6.248443 -0.23347
C  1.398431 -5.796646 -0.854319
H  -1.804231 -0.541078 -0.014658
C  0.504009 -5.717226 1.882749
H  -0.307868 -5.469373 2.582171
H  0.692415 -6.801069 1.915255
H  1.411313 -5.181694 2.198749
H  -2.231902 -6.003509 0.416141
H  -1.124923 -7.312481 -0.112762
H  -1.670146 -6.060872 -1.277342
H  1.161798 -5.596156 -1.909622
H  1.548981 -6.877954 -0.715189
H  2.327143 -5.265574 -0.598783
H  -1.162211 1.907349 -0.064949
H  2.327581 1.278371 0.830333
H  3.020238 1.738901 -0.724002
C  1.061911 3.705878 -0.059541
C  -0.102983 4.511049 -0.081534
C  2.31478 4.310792 0.199393
C  -0.003304 5.870921 0.141947
H  -1.07926 4.064566 -0.273674
C  2.400238 5.675044 0.428125
H  3.223108 3.706253 0.218354
C  1.245724 6.455179 0.397698
H  3.367228 6.140126 0.626375
H  1.315217 7.532043 0.57362
C  -1.228527 6.752636 0.126063
F  -1.418142 7.340313 1.313295
F  -1.109596 7.731151 -0.778572
F  -2.337271 6.069142 -0.164839
totalener: -1397.25822084148786 hartree
nucrepener: 1853.42774590861222 hartree
electener: -3250.59597427798053 hartree
oneelecener: -5631.54025949691277 hartree
twoeener: 2380.94428521893224 hartree
cpcmener: -0.08379482793808 hartree
kineticenergy: 1296.89530181831651 hartree
energy: -2100.3990 -676.1311 -675.9772 -675.9697 -287.4086 -283.6395 -281.9468 -281.8954 -281.8319 -281.8082 -281.7085 -281.2860 -281.1503 -281.1000 -280.4605 -280.4554 -280.3063 -280.3013 -280.2960 -279.7034 -182.4117 -132.2491 -132.2488 -132.1664 -116.0560 -66.6722 -66.2248 -66.2150 -39.2264 -36.6426 -36.5093 -28.3949 -27.4973 -25.6009 -25.0814 -24.5025 -23.8901 -23.3468 -22.7293 -22.1028 -22.0986 -21.5521 -20.9624 -20.5083 -19.7119 -19.5793 -19.4837 -18.2505 -18.1261 -17.6476 -17.4293 -16.8405 -16.5045 -16.2892 -16.1747 -15.9724 -15.6233 -15.2516 -15.1716 -14.9808 -14.9019 -14.7160 -14.7105 -14.5903 -14.4397 -14.3557 -14.3163 -13.9941 -13.8668 -13.8614 -13.7233 -13.4221 -13.3902 -13.2293 -12.9123 -12.7817 -12.3202 -12.2878 -12.1510 -11.4352 -10.9346 -10.8534 -10.7993 -10.7968 -10.7359 -9.6645 -9.1401 -9.0215 -2.3529 0.4738 0.9107 1.3931 1.4750 2.7890 3.0628 3.5362 3.8946 4.1519 4.2659 electronvolt
chargesum: 1.0000000
charge: -0.056284 -0.309113 -0.223948 -0.108857 0.139034 0.147043 0.071528 0.076136 0.071694 0.008799 0.090399 -0.176770 -0.177572 0.037045 -0.178118 0.098805 0.087282 0.097499 0.098824 0.086904 0.098523 0.098550 0.087164 0.097188 0.117304 0.138532 0.116957 0.018704 0.036463 0.028765 -0.185632 0.079702 -0.020620 0.085541 0.069668 0.078857 0.091806 0.611187 -0.179839 -0.179815 -0.169337
charge: -0.325285 -0.245143 -0.053257 0.259367 -0.024762 0.112636 -0.017728 0.048266 0.052011 -0.024949 0.734664 -0.188390 -0.189015 0.039500 -0.189004 0.052066 0.043592 0.051629 0.052225 0.043644 0.052141 0.051923 0.043643 0.051505 0.074565 0.104211 0.072630 -0.073676 0.079673 0.079923 -0.093486 0.061397 -0.013110 0.064321 0.084643 0.061926 0.067467 0.178688 -0.063942 -0.063194 -0.053314
qa: -0.0563 -0.3091 -0.2239 -0.1089 0.1390 0.1470 0.0715 0.0761 0.0717 0.0088 0.0904 -0.1768 -0.1776 0.0370 -0.1781 0.0988 0.0873 0.0975 0.0988 0.0869 0.0985 0.0985 0.0872 0.0972 0.1173 0.1385 0.1170 0.0187 0.0365 0.0288 -0.1856 0.0797 -0.0206 0.0855 0.0697 0.0789 0.0918 0.6112 -0.1798 -0.1798 -0.1693
va: 1.6359 3.8488 4.1430 3.8720 3.7999 0.9766 3.9441 0.9779 0.9861 3.9753 4.0931 3.8965 3.8965 0.9671 3.8958 0.9845 0.9897 0.9848 0.9849 0.9899 0.9848 0.9846 0.9899 0.9851 0.9912 0.9734 0.9800 3.7886 3.8977 3.8379 3.7879 1.0154 3.8757 0.9905 3.8768 0.9834 0.9907 4.3854 1.1669 1.1669 1.1934
dispcorr: -0.017479116 hartree
energy: -1397.278618003155
temp: 298.15 k
press: 1.00 atm
zeropoint: 0.32390898 hartree
thermalvibcorrection: 0.02076845 hartree
thermalrotcorrection: 0.00141627 hartree
thermaltrasncorrection: 0.00141627 hartree
thermaltotal: -1396.93110803 hartree
thermalcorr: 0.02360100 hartree
nonthermalcorr: 0.32390898 hartree
totalcorr: 0.34750998 hartree
thermalcorrenthalpy: 0.00094421 hartree
totalenthalpy: -1396.93016382 hartree
totalentropycorr: -0.07692229 hartree
gibbsenthalpy: -1397.00708610 hartree
gibbsminuselec: 0.27153190 hartree
