program: Orca
programVersion: 6.0.x
elementType: Au C C C C H C H H C P C C H C H H H H H H H H H H H H C C C C H C H C H H N C C H H H H C H H C H H
elementType: Au
keywords: opt freq wb97x-d3 def2-svp autoaux tightscf
charge: 1
multiplicity: 1
frequency: 0.00 0.00 0.00 0.00 0.00 0.00 8.81 9.88 20.71 32.24 45.76 57.29 82.85 87.84 103.51 123.41 133.30 149.92 160.38 175.04 189.44 190.81 200.98 226.76 232.22 235.66 239.63 265.67 267.64 270.02 293.60 308.77 355.36 405.18 435.05 437.60 458.50 474.93 494.75 545.24 589.94 614.99 629.02 633.47 675.86 695.06 721.77 760.84 762.43 773.85 778.07 797.33 807.76 827.34 843.67 860.29 861.61 867.10 876.26 878.46 889.16 920.87 942.53 952.39 958.39 960.25 968.69 972.27 984.13 992.70 998.92 1005.74 1013.24 1032.89 1034.95 1068.09 1117.14 1126.17 1146.55 1149.87 1163.98 1193.70 1205.48 1212.55 1220.19 1221.40 1245.04 1253.09 1277.91 1279.89 1287.59 1298.30 1304.56 1304.70 1319.88 1322.56 1337.39 1345.89 1364.70 1366.21 1370.94 1385.84 1392.53 1414.17 1416.18 1416.74 1418.05 1424.68 1424.75 1430.32 1442.52 1448.48 1456.30 1461.36 1469.62 1480.71 1547.81 1579.41 1614.11 1687.24 1695.47 1727.75 3034.08 3059.58 3061.56 3067.77 3069.42 3069.96 3075.49 3078.62 3094.21 3094.71 3095.01 3141.75 3150.41 3153.18 3159.04 3159.65 3168.97 3174.02 3184.61 3185.39 3185.97 3190.63 3191.29 3191.89 3236.92 3238.40 3261.47 3262.20
frequency: 8.81 9.88 20.71 32.24 45.76 57.29 82.85 87.84 103.51 123.41 133.30 149.92 160.38 175.04 189.44 190.81 200.98 226.76 232.22 235.66 239.63 265.67 267.64 270.02 293.60 308.77 355.36 405.18 435.05 437.60 458.50 474.93 494.75 545.24 589.94 614.99 629.02 633.47 675.86 695.06 721.77 760.84 762.43 773.85 778.07 797.33 807.76 827.34 843.67 860.29 861.61 867.10 876.26 878.46 889.16 920.87 942.53 952.39 958.39 960.25 968.69 972.27 984.13 992.70 998.92 1005.74 1013.24 1032.89 1034.95 1068.09 1117.14 1126.17 1146.55 1149.87 1163.98 1193.70 1205.48 1212.55 1220.19 1221.40 1245.04 1253.09 1277.91 1279.89 1287.59 1298.30 1304.56 1304.70 1319.88 1322.56 1337.39 1345.89 1364.70 1366.21 1370.94 1385.84 1392.53 1414.17 1416.18 1416.74 1418.05 1424.68 1424.75 1430.32 1442.52 1448.48 1456.30 1461.36 1469.62 1480.71 1547.81 1579.41 1614.11 1687.24 1695.47 1727.75 3034.08 3059.58 3061.56 3067.77 3069.42 3069.96 3075.49 3078.62 3094.21 3094.71 3095.01 3141.75 3150.41 3153.18 3159.04 3159.65 3168.97 3174.02 3184.61 3185.39 3185.97 3190.63 3191.29 3191.89 3236.92 3238.40 3261.47 3262.20
formula: C19H28AuNP
InChI: InChI=1/C16H19N.C3H9P.Au/c1-13-4-5-15(12-13)14-6-8-16(9-7-14)17-10-2-3-11-17;1-4(2)3;/h1,6-9H,2-5,10-12H2;1-3H3;/rC19H28AuNP/c1-22(2,3)20-15-16-6-7-18(14-16)17-8-10-19(11-9-17)21-12-4-5-13-21/h8-11,15H,4-7,12-14H2,1-3H3
50 atoms
Au -0.38869 -3.467547 -0.075558
C  -1.056119 -1.540031 -0.304031
C  -0.341238 -0.45543 -0.645423
C  0.276058 1.859814 -0.486428
C  -0.882233 0.957978 -0.790694
H  -1.173943 1.148687 -1.842934
C  1.145833 -0.356065 -0.915531
H  1.332109 -0.400891 -2.003434
H  1.72091 -1.167475 -0.448211
C  1.526089 1.03225 -0.385209
P  0.353158 -5.675573 0.193765
C  -0.986987 -6.90286 0.331817
C  1.391345 -6.287213 -1.173484
H  -2.128134 -1.333227 -0.142824
C  1.365664 -5.948284 1.68459
H  0.781267 -5.686252 2.578781
H  1.681656 -7.000315 1.753589
H  2.256897 -5.304534 1.650152
H  -1.622714 -6.657554 1.195318
H  -0.575652 -7.915642 0.460282
H  -1.607211 -6.876445 -0.576155
H  0.825624 -6.24146 -2.115643
H  1.704954 -7.326062 -0.989478
H  2.283544 -5.651457 -1.270834
H  -1.772193 1.168082 -0.179044
H  1.781011 0.976095 0.68954
H  2.387428 1.495199 -0.887484
C  0.20497 3.226561 -0.316217
C  -1.04541 3.936754 -0.416371
C  1.37564 4.015017 -0.024372
C  -1.125755 5.283371 -0.249465
H  -1.959995 3.379974 -0.630938
C  1.313415 5.361223 0.152704
H  2.346107 3.521109 0.056418
C  0.055113 6.057107 0.043995
H  -2.092587 5.780059 -0.325309
H  2.224547 5.919351 0.365464
N  -0.013071 7.367775 0.207836
C  -1.243251 8.160347 0.053021
C  1.133442 8.217583 0.568725
H  -1.771276 7.876694 -0.867704
H  -1.912093 7.968633 0.90867
H  1.691014 7.774054 1.404902
H  1.81262 8.300855 -0.296044
C  -0.744638 9.601538 0.031826
H  -0.467327 9.885981 -0.995551
H  -1.510445 10.306097 0.382956
C  0.495507 9.557193 0.922262
H  0.2037 9.564719 1.984339
H  1.185201 10.39528 0.754472
totalener: -1271.78288044350234 hartree
nucrepener: 1911.53868372215038 hartree
electener: -3183.23677272445730 hartree
oneelecener: -5563.81051869160638 hartree
twoeener: 2380.57374596714908 hartree
cpcmener: -0.07342846345840 hartree
kineticenergy: 1170.97785443376301 hartree
temp: 298.15 k
press: 1.00 atm
thermalcorrenthalpy: 0.00094421 hartree
totalenthalpy: -1271.34965918 hartree
totalentropycorr: -0.07230667 hartree
gibbsenthalpy: -1271.42196585 hartree
gibbsminuselec: 0.38218289 hartree
totalenthalpy: -1271.34952082 hartree
totalenthalpy: -1271.34760202 hartree
totalenthalpy: -1271.34881068 hartree
totalenthalpy: -1271.35080206 hartree
totalenthalpy: -1271.34869345 hartree
totalenthalpy: -1271.34874704 hartree
totalenthalpy: -1271.34899509 hartree
totalenthalpy: -1271.34933886 hartree
totalenthalpy: -1271.34865511 hartree
totalenthalpy: -1271.34878515 hartree
totalenthalpy: -1271.34789737 hartree
energy: -2100.3358 -394.8246 -282.8174 -282.1557 -281.4176 -281.4163 -281.3316 -281.3285 -280.9616 -280.8531 -280.8519 -280.5886 -280.5379 -280.3541 -280.3520 -280.2570 -280.2544 -280.2512 -280.1675 -280.1307 -279.4727 -182.3475 -132.1853 -132.1851 -132.1010 -115.9554 -66.5686 -66.1236 -66.1155 -30.4335 -27.5384 -26.7183 -25.5849 -24.4913 -24.4506 -24.1787 -23.6221 -23.2295 -22.5105 -22.0537 -22.0474 -21.2950 -20.5984 -20.1572 -19.3310 -19.0654 -18.4949 -18.0708 -18.0246 -17.4568 -17.1006 -16.4194 -16.1515 -15.7896 -15.4599 -15.1747 -15.0627 -14.9388 -14.8391 -14.7958 -14.6627 -14.6601 -14.4314 -14.3239 -14.0151 -13.8182 -13.8173 -13.7350 -13.6725 -13.3440 -13.2143 -13.1530 -12.8926 -12.5128 -12.4628 -12.4233 -12.2221 -12.1891 -12.0173 -11.9153 -11.8469 -11.4686 -11.3209 -10.7382 -10.7068 -10.6957 -10.4887 -9.5849 -9.0214 -8.8377 -8.6461 -1.4748 1.0284 1.2830 1.4737 2.3100 2.8720 3.2802 3.5837 3.6577 4.0495 4.2865 electronvolt
chargesum: 1.0000000
charge: -0.068442 -0.318357 -0.225839 -0.201954 0.159888 0.103721 0.058254 0.063887 0.060321 0.030563 0.088781 -0.177015 -0.178360 0.028908 -0.178474 0.098072 0.085877 0.096965 0.098116 0.085719 0.098379 0.098585 0.085906 0.097019 0.087009 0.097894 0.085283 0.007651 0.010986 0.010711 -0.088409 0.068956 -0.089981 0.067014 0.220647 0.058263 0.058057 -0.352239 0.113736 0.113802 0.084720 0.078896 0.084382 0.078790 -0.072201 0.061900 0.066759 -0.071875 0.061781 0.066947
charge: -0.337559 -0.259533 -0.048654 0.144122 -0.031930 0.078090 -0.024098 0.042552 0.046343 -0.031531 0.733340 -0.189108 -0.189642 0.034931 -0.189600 0.051602 0.042944 0.051243 0.051835 0.043048 0.051884 0.051775 0.043004 0.051356 0.059775 0.072071 0.054987 -0.103272 0.058857 0.058651 -0.067093 0.058227 -0.067307 0.057793 0.104430 0.053488 0.053322 0.027556 0.052194 0.052309 0.043719 0.041587 0.043536 0.041615 -0.037080 0.037966 0.042687 -0.037171 0.037991 0.042747
qa: -0.0684 -0.3184 -0.2258 -0.2020 0.1599 0.1037 0.0583 0.0639 0.0603 0.0306 0.0888 -0.1770 -0.1784 0.0289 -0.1785 0.0981 0.0859 0.0970 0.0981 0.0857 0.0984 0.0986 0.0859 0.0970 0.0870 0.0979 0.0853 0.0077 0.0110 0.0107 -0.0884 0.0690 -0.0900 0.0670 0.2206 0.0583 0.0581 -0.3522 0.1137 0.1138 0.0847 0.0789 0.0844 0.0788 -0.0722 0.0619 0.0668 -0.0719 0.0618 0.0669
va: 1.6465 3.8455 4.1507 4.0381 3.7960 0.9839 3.9522 0.9775 0.9857 3.9762 4.0844 3.8962 3.8959 0.9663 3.8955 0.9845 0.9900 0.9850 0.9850 0.9902 0.9849 0.9844 0.9901 0.9852 0.9946 0.9790 0.9820 3.7552 3.8769 3.8793 3.8794 0.9922 3.8815 0.9927 3.7551 0.9955 0.9954 3.3846 3.8930 3.8934 0.9764 0.9782 0.9763 0.9781 4.0549 0.9768 0.9822 4.0548 0.9768 0.9821
dispcorr: -0.021283464 hartree
energy: -1271.805116768447
zeropoint: 0.43165584 hartree
thermalvibcorrection: 0.02187734 hartree
thermalrotcorrection: 0.00141627 hartree
thermaltrasncorrection: 0.00141627 hartree
thermaltotal: -1271.34875104 hartree
thermalcorr: 0.02470988 hartree
nonthermalcorr: 0.43165584 hartree
totalcorr: 0.45636572 hartree
totalenthalpy: -1271.34780684 hartree
