program: Orca
programVersion: 6.0.x
elementType: Au C C C C H C H H C P C C H C H H H H H H H H H H H H C C C C H C H C H H N C C H H H H H H
elementType: Au
keywords: opt freq wb97x-d3 def2-svp autoaux tightscf
charge: 1
multiplicity: 1
frequency: 0.00 0.00 0.00 0.00 0.00 0.00 4.56 13.83 24.42 37.33 52.08 55.77 68.18 92.34 100.06 117.98 128.26 151.86 167.99 174.81 184.59 185.55 189.93 202.44 220.92 228.01 235.95 264.04 269.84 272.54 316.89 324.78 356.84 409.21 438.38 447.74 464.92 472.89 513.48 549.47 588.90 616.45 630.19 643.49 694.80 720.26 762.20 762.97 765.67 780.30 798.44 807.39 829.03 846.81 861.49 862.32 870.22 880.54 920.20 959.41 960.08 969.30 970.00 983.94 989.17 999.01 1013.16 1033.27 1035.04 1087.73 1116.78 1118.28 1148.13 1152.49 1153.21 1165.76 1195.40 1205.60 1214.92 1246.04 1277.94 1279.31 1288.64 1299.31 1305.08 1305.39 1320.50 1341.59 1349.00 1367.93 1392.42 1413.34 1416.01 1417.08 1417.30 1423.85 1424.31 1430.74 1432.37 1433.10 1442.60 1447.38 1454.36 1461.55 1466.63 1480.57 1549.19 1578.37 1611.70 1678.87 1693.96 1730.48 3035.17 3057.06 3060.48 3068.35 3069.67 3069.86 3071.65 3075.95 3094.37 3138.87 3152.25 3154.79 3169.98 3170.66 3184.99 3185.91 3186.33 3190.98 3191.28 3192.21 3218.95 3226.15 3238.13 3238.54 3267.03 3268.56
frequency: 4.56 13.83 24.42 37.33 52.08 55.77 68.18 92.34 100.06 117.98 128.26 151.86 167.99 174.81 184.59 185.55 189.93 202.44 220.92 228.01 235.95 264.04 269.84 272.54 316.89 324.78 356.84 409.21 438.38 447.74 464.92 472.89 513.48 549.47 588.90 616.45 630.19 643.49 694.80 720.26 762.20 762.97 765.67 780.30 798.44 807.39 829.03 846.81 861.49 862.32 870.22 880.54 920.20 959.41 960.08 969.30 970.00 983.94 989.17 999.01 1013.16 1033.27 1035.04 1087.73 1116.78 1118.28 1148.13 1152.49 1153.21 1165.76 1195.40 1205.60 1214.92 1246.04 1277.94 1279.31 1288.64 1299.31 1305.08 1305.39 1320.50 1341.59 1349.00 1367.93 1392.42 1413.34 1416.01 1417.08 1417.30 1423.85 1424.31 1430.74 1432.37 1433.10 1442.60 1447.38 1454.36 1461.55 1466.63 1480.57 1549.19 1578.37 1611.70 1678.87 1693.96 1730.48 3035.17 3057.06 3060.48 3068.35 3069.67 3069.86 3071.65 3075.95 3094.37 3138.87 3152.25 3154.79 3169.98 3170.66 3184.99 3185.91 3186.33 3190.98 3191.28 3192.21 3218.95 3226.15 3238.13 3238.54 3267.03 3268.56
formula: C17H26AuNP
InChI: InChI=1/C14H17N.C3H9P.Au/c1-11-4-5-13(10-11)12-6-8-14(9-7-12)15(2)3;1-4(2)3;/h1,6-9H,4-5,10H2,2-3H3;1-3H3;/rC17H26AuNP/c1-19(2)17-10-8-15(9-11-17)16-7-6-14(12-16)13-18-20(3,4)5/h8-11,13H,6-7,12H2,1-5H3
46 atoms
Au -0.337898 -2.90654 0.189181
C  -1.019968 -0.971723 0.13378
C  -0.397019 0.116614 -0.347098
C  0.220862 2.438547 -0.338394
C  -0.966883 1.525784 -0.376896
H  -1.485683 1.706927 -1.339486
C  1.000563 0.226488 -0.920728
H  0.957637 0.183295 -2.023753
H  1.668616 -0.578552 -0.584667
C  1.470744 1.618941 -0.480117
P  0.395755 -5.133225 0.244377
C  -0.924652 -6.339305 0.594173
C  1.130898 -5.710226 -1.320235
H  -2.035774 -0.767935 0.514377
C  1.672646 -5.476435 1.498243
H  1.285424 -5.2277 2.497215
H  1.966935 -6.536771 1.477073
H  2.556315 -4.851438 1.302411
H  -1.369121 -6.12553 1.577318
H  -0.527381 -7.365679 0.591406
H  -1.711364 -6.252488 -0.169634
H  0.39219 -5.615176 -2.129678
H  1.448389 -6.761002 -1.240002
H  2.001939 -5.086683 -1.570039
H  -1.702719 1.734239 0.414213
H  1.927011 1.567982 0.526461
H  2.217413 2.082207 -1.140468
C  0.170295 3.809743 -0.187309
C  -1.082301 4.504921 -0.044097
C  1.36266 4.616142 -0.163241
C  -1.14627 5.855331 0.10455
H  -2.014074 3.935531 -0.054514
C  1.317804 5.966887 -0.008415
H  2.336604 4.134242 -0.271356
C  0.056146 6.650292 0.132255
H  -2.118903 6.333321 0.210082
H  2.248091 6.532742 0.000514
N  0.002602 7.970585 0.281381
C  -1.279471 8.660995 0.382013
C  1.223213 8.768813 0.338725
H  -1.098726 9.739232 0.429442
H  -1.907379 8.454343 -0.496684
H  -1.823197 8.358595 1.28974
H  0.957361 9.809632 0.547727
H  1.887449 8.416622 1.140967
H  1.766174 8.732717 -0.617958
totalener: -1194.40472310039581 hartree
nucrepener: 1682.95190950177653 hartree
electener: -2877.27577885903474 hartree
oneelecener: -5005.30993494650374 hartree
twoeener: 2128.03415608746900 hartree
cpcmener: -0.07234242101677 hartree
kineticenergy: 1093.82973937698034 hartree
energy: -2100.3374 -394.9317 -282.8074 -282.2161 -281.3509 -281.3418 -281.3330 -281.3296 -280.9813 -280.8585 -280.8544 -280.6127 -280.5554 -280.2596 -280.2575 -280.2527 -280.1772 -280.1480 -279.4791 -182.3500 -132.1877 -132.1875 -132.1036 -115.9602 -66.5732 -66.1286 -66.1200 -30.3014 -27.5183 -26.6046 -24.7275 -24.4984 -24.4514 -23.3967 -23.2332 -23.0358 -22.0582 -22.0516 -21.8299 -20.6246 -19.9423 -19.6053 -18.5082 -18.0615 -17.8093 -17.4153 -16.8756 -16.3432 -16.1439 -15.9125 -15.5714 -15.1753 -15.1168 -15.0194 -14.7240 -14.6663 -14.6504 -14.3794 -14.1672 -14.0182 -13.8874 -13.8249 -13.8232 -13.7207 -13.4661 -13.3452 -13.2792 -13.1434 -12.8996 -12.4775 -12.2255 -12.1927 -12.0293 -11.9277 -11.5484 -11.3278 -10.7379 -10.7113 -10.7015 -10.4901 -9.5887 -9.0348 -8.8586 -8.6740 -1.5204 1.0208 1.2720 1.4696 2.3119 2.8655 3.2810 3.6441 3.7910 4.1514 4.3088 electronvolt
chargesum: 1.0000000
charge: -0.068860 -0.318629 -0.224659 -0.196676 0.157674 0.104945 0.056387 0.064622 0.060593 0.030502 0.089555 -0.176981 -0.178785 0.029559 -0.178416 0.098395 0.086290 0.096838 0.098006 0.085956 0.098252 0.098470 0.086207 0.097019 0.089111 0.099735 0.086020 0.008165 0.007684 0.008515 -0.087717 0.069699 -0.090756 0.067649 0.228986 0.052653 0.052503 -0.326501 0.065982 0.065417 0.083640 0.084728 0.084831 0.083641 0.085159 0.084594
charge: -0.336860 -0.259430 -0.048970 0.149304 -0.032112 0.078926 -0.023931 0.042665 0.046272 -0.031144 0.733505 -0.189017 -0.189574 0.035240 -0.189951 0.051684 0.043141 0.051346 0.051812 0.043072 0.052009 0.051838 0.043007 0.051346 0.061157 0.073497 0.055115 -0.103191 0.060245 0.060000 -0.067423 0.058502 -0.067706 0.058056 0.104793 0.053743 0.053548 0.024678 0.038075 0.037948 0.047744 0.044778 0.044884 0.047775 0.044894 0.044710
qa: -0.0689 -0.3186 -0.2247 -0.1967 0.1577 0.1049 0.0564 0.0646 0.0606 0.0305 0.0896 -0.1770 -0.1788 0.0296 -0.1784 0.0984 0.0863 0.0968 0.0980 0.0860 0.0983 0.0985 0.0862 0.0970 0.0891 0.0997 0.0860 0.0082 0.0077 0.0085 -0.0877 0.0697 -0.0908 0.0676 0.2290 0.0527 0.0525 -0.3265 0.0660 0.0654 0.0836 0.0847 0.0848 0.0836 0.0852 0.0846
va: 1.6463 3.8456 4.1524 4.0302 3.7948 0.9839 3.9507 0.9774 0.9856 3.9752 4.0859 3.8963 3.8960 0.9660 3.8957 0.9844 0.9898 0.9851 0.9850 0.9901 0.9849 0.9844 0.9899 0.9851 0.9941 0.9790 0.9823 3.7525 3.8830 3.8832 3.8837 0.9920 3.8880 0.9921 3.7390 0.9992 0.9992 3.4242 3.8876 3.8876 0.9952 0.9852 0.9849 0.9952 0.9852 0.9850
dispcorr: -0.019063161 hartree
energy: -1194.442786132860
temp: 298.15 k
press: 1.00 atm
zeropoint: 0.39413506 hartree
thermalvibcorrection: 0.02147497 hartree
thermalrotcorrection: 0.00141627 hartree
thermaltrasncorrection: 0.00141627 hartree
thermaltotal: -1194.02434356 hartree
thermalcorr: 0.02430751 hartree
nonthermalcorr: 0.39413506 hartree
totalcorr: 0.41844257 hartree
thermalcorrenthalpy: 0.00094421 hartree
totalenthalpy: -1194.02339935 hartree
totalentropycorr: -0.07817941 hartree
gibbsenthalpy: -1194.10157876 hartree
gibbsminuselec: 0.34120737 hartree
