program: Gaussian 09
title: 000066131
version: EM64L-G09RevD.01
frameworkgroup: C1[X(C4H5N3O2)]
method: RPBEPBE
basis: SDD
operation: Freq
keyword: #pfreq=noraman
keyword: PBEPBE/SDD
title: #p freq=noraman PBEPBE/SDD
converged: NO NO NO NO
title: Mulliken charges:
elementType: O O N N N C C C C H H H H H
charge: -0.390837 -0.273038 -0.408139 -0.059427 -0.615252 0.199488 0.200461 -0.460085 0.194049 0.327284 0.242013 0.356884 0.323452 0.363147
chargesum: 0.00000
title: Mulliken charges with hydrogens summed into heavy atoms:
elementType: O O N N N C C C C
charge: -0.027690 -0.273038 -0.080854 -0.059427 0.065084 0.199488 0.200461 -0.218072 0.194049
polarizability: 9.30935722e+01 2.77103449e+00 9.34639847e+01 -5.24720504e-03 -4.34553930e-03 3.02335907e+01
1716.lowfreq: -9.4210 -7.4953 0.0006 0.0007 0.0010 6.1876 162.2553 177.6436 207.5152
frequency: 162.2548 177.6298 207.5152 314.5410 321.2735 346.8624 441.0499 496.8454 519.7981 533.3499 556.3122 615.1735 626.5105 653.3283 703.7235 730.5404 791.1747 918.2268 925.1266 1008.6839 1077.1362 1183.4679 1204.1419 1217.6648 1304.5422 1434.0383 1486.4041 1533.6307 1581.9619 1628.7267 1660.7476 3179.3277 3513.6164 3555.6594 3571.2347 3708.0892
redmass: 4.0303 7.7212 5.7257 3.4601 1.1189 7.0395 1.1212 7.0253 8.1672 1.1443 4.0689 8.1719 1.7021 3.7658 2.1555 3.6325 2.3651 4.1650 3.6996 2.7403 1.9489 1.4680 6.3747 1.7991 1.5966 3.5539 4.9297 7.1375 2.1534 1.9058 5.8135 1.0931 1.0778 1.0457 1.0655 1.1053
irintensity: 0.0790 1.8291 25.6097 6.1390 90.0196 16.7138 102.2918 2.0356 2.1197 258.0852 2.7449 1.8201 98.8831 7.6474 13.2890 7.1251 102.7909 7.5390 6.3565 54.8201 120.5101 32.0446 22.2651 201.4183 40.3080 79.0017 60.3183 161.7791 238.0689 711.8085 521.0704 1.4725 27.8377 113.6073 45.1516 49.0829
temp: 298.150 k
press: 1.00000 atm
elementType: 8 8 7 7 7 6 6 6 6 1 1 1 1 1
symmnumber: 1
zpe: 262522.4 jmol-1
zpe.correction: 0.099989 hartree
zpe.thermalcorrener: 0.107817 hartree
zpe.thermalcorrenthalpy: 0.108762 hartree
zpe.thermalcorrgfe: 0.067908 hartree
zpe.sumelectzpe: -469.482969 hartree
zpe.sumelectthermal: -469.475142 hartree
zpe.sumelectthermalent: -469.474197 hartree
zpe.sumelectthermalfe: -469.515051 hartree
dipole: -2.6451 -2.5447 0.0001
dipole: 3.6704
quadrupole: -29.2962 -66.9716 -54.3213
quadrupole: 11.4433 -0.0026 -0.0009
quadrupole: 20.9002 -16.7753 -4.1250 11.4433 -0.0026 -0.0009
hfenergy: -469.5829589 hartree
pointgroup: C01[X(C4H5N3O2)]
dipole: -0.5675328 -1.3278538 -0.0000507 debye
dipolederiv: -0.8520317 0.6795971 0.0000346 0.7117848 -0.7784236 0.0000029 -0.000014 -0.000008 -0.431582 -1.4265837 -0.1561242 -0.0001885 -0.0323037 -0.470636 -0.0000401 0.0002782 0.0000018 -0.3870165 -0.842231 -0.2774991 0.0000058 -0.3749435 -0.7466552 -0.0000247 -0.0001132 -0.0001139 -0.2848311 -0.5094225 0.3438498 0.0000139 -0.1864712 -1.6875643 -0.0001784 0.0000049 -0.0001832 -0.2898509 -0.3225484 -0.3410328 -0.0000589 -0.4003324 -1.4750488 -0.0001088 -0.0000666 0.0000161 -0.7457249 0.9240927 -0.1516286 0.000016 0.3020245 2.0592628 0.0002104 0.0000836 0.0000699 0.2899301 1.8484802 0.268268 0.0001856 0.0149549 0.914874 0.0000897 -0.0001342 0.000175 0.2139398 -1.1350578 0.0414826 -0.0000536 0.2567636 -0.3212259 -0.0000284 -0.0000747 -0.000015 -0.3181818 1.4947288 -0.2702514 0.0001025 -0.1530507 1.7049575 0.0001893 0.0000875 0.0001518 0.2039543 0.1534765 0.0231983 -0.0000205 -0.0241272 0.1321102 -0.0000449 -0.0000251 -0.0000441 0.3433926 0.0690965 -0.0266141 -0.0000289 -0.0047607 -0.0531911 -0.0000141 -0.0000045 0.0000069 0.2131185 0.2301326 0.0801386 0.0000084 0.0475286 0.2269541 -0.0000185 0.0000045 0.0000053 0.4029494 0.1337333 -0.0105561 0.000007 0.0276729 0.2593145 -0.000013 0.0000068 -0.0000475 0.4038623 0.2341345 -0.202828 -0.0000236 -0.1847398 0.2352718 -0.0000213 -0.0000329 -0.0000151 0.3860402 unknown
polarizability: 91.5813237|2.1980858|94.9762331|0.0022046|0.0064464|30.2335907 unknown
InChI: InChI=1S/C4H5N3O2/c5-4-6-2(8)1-3(9)7-4/h1,6,9H,5H2
charge 0 multiplicity 1
14 atoms
O  -1.954625 1.887213 -0.000267
O  2.732409 0.518094 -0.000323
N  0.948557 -0.996653 -0.000361
N  -1.347484 -0.32852 -0.000434
N  -0.810633 -2.596777 -0.000666
C  -0.40545 -1.281817 -0.000554
C  1.474033 0.35637 0.000024
C  0.438075 1.362231 -0.000123
C  -0.905819 0.972944 -0.000247
H  1.663683 -1.730171 -0.000429
H  0.755455 2.407874 -0.000064
H  -1.814617 -2.764051 -0.000671
H  -0.1637 -3.379768 -0.00079
H  -1.605084 2.814532 -0.000195
