program: Gaussian 09
title: 000066167
version: EM64L-G09RevD.01
frameworkgroup: C1[X(C12H14O2)]
method: RPBEPBE
basis: SDD
operation: Freq
keyword: #pfreq=noraman
keyword: PBEPBE/SDD
title: #p freq=noraman PBEPBE/SDD
converged: YES YES NO NO
title: Mulliken charges:
elementType: O O C C C C C C C C C C C C H H H H H H H H H H H H H H
charge: -0.415339 -0.237403 0.150019 -0.492563 -0.517655 -0.478754 -0.420899 0.385729 0.137375 -0.349513 -0.384147 -0.249859 -0.240039 -0.239831 0.207472 0.251751 0.240790 0.231097 0.212012 0.227620 0.229221 0.209130 0.240824 0.246353 0.225877 0.224763 0.377163 0.228806
chargesum: 0.00000
title: Mulliken charges with hydrogens summed into heavy atoms:
elementType: O O C C C C C C C C C C C C
charge: -0.038176 -0.237403 0.150019 -0.033341 -0.045767 -0.039122 0.017452 0.385729 0.137375 -0.108688 -0.137794 -0.023982 -0.015276 -0.011025
polarizability: 1.60220078e+02 2.39058748e+00 1.06544764e+02 -1.96861880e-01 -1.68135391e+01 1.14190055e+02
1716.lowfreq: -13.0576 -4.4906 -1.7994 0.0005 0.0008 0.0009 18.0938 40.6759 44.9893
frequency: 15.7107 40.4493 44.8448 83.4702 126.8214 150.9951 228.9944 254.3321 303.1357 342.2474 354.7548 399.9522 461.3173 508.5527 545.6147 577.4524 612.6288 624.7555 646.0760 693.8922 701.8725 711.6130 766.0985 788.4027 820.7827 849.6460 861.2438 895.7655 917.3390 953.9397 970.2656 974.9497 985.8099 991.3046 995.5514 1024.0532 1031.0367 1053.0195 1074.0320 1079.3628 1136.3516 1172.7162 1173.0667 1194.6682 1206.8088 1214.4758 1219.7801 1240.1944 1271.3910 1281.1547 1300.6739 1310.6974 1316.1033 1322.4599 1377.6901 1434.0569 1461.6558 1469.4866 1472.9738 1482.0711 1489.5911 1589.2431 1608.8379 1640.7428 2996.9934 2999.1192 3008.9654 3021.4542 3052.4637 3072.5483 3088.7451 3094.7523 3122.8116 3130.9607 3144.1526 3153.5198 3165.3861 3511.3945
redmass: 3.9056 2.8480 3.7343 4.8709 3.0782 3.4825 3.6927 2.9576 4.1009 3.8209 3.8151 2.8089 3.6916 3.8243 2.2031 2.2254 4.5302 2.3537 3.2894 3.2694 2.0406 2.7525 1.6843 1.5572 1.7345 1.2646 2.9034 2.9241 1.4524 2.6105 2.3323 1.3946 2.1446 3.8567 1.4655 1.7974 2.1337 1.9983 2.3852 1.7026 3.7634 1.1922 1.2599 1.1254 1.4803 1.4716 2.3650 1.2487 1.2804 1.5806 1.5313 1.4377 1.5123 1.3678 7.6199 2.2319 1.0845 1.0961 1.0822 2.1544 1.0987 6.0742 6.0787 8.6998 1.0625 1.0643 1.0613 1.0649 1.1002 1.1020 1.1006 1.1031 1.0845 1.0879 1.0927 1.0956 1.1011 1.0639
irintensity: 0.0479 0.5491 0.6587 0.3593 0.1056 0.1548 1.3088 0.5053 0.0872 4.2314 4.0979 0.0129 4.2976 4.2841 27.6570 70.4648 9.2773 44.1905 38.6836 15.2254 53.2868 16.7659 37.2529 1.3302 0.5705 0.3320 3.4979 5.1075 1.4846 4.7478 16.9843 0.1559 32.7142 1.0185 5.2473 120.6012 11.8973 85.6026 0.5088 10.9917 8.0990 0.8591 0.9676 0.7651 4.7229 3.8305 4.0862 2.3536 1.5813 5.1645 9.7262 4.2343 7.5632 1.1605 0.0291 9.8572 4.9330 12.3178 10.4995 21.6357 7.3372 1.6890 17.8739 183.1644 28.1115 18.9978 59.6204 27.3568 14.8285 30.2763 11.5566 39.2406 1.1844 4.0143 23.7761 32.3046 15.8293 23.8579
temp: 298.150 k
press: 1.00000 atm
elementType: 8 8 6 6 6 6 6 6 6 6 6 6 6 6 1 1 1 1 1 1 1 1 1 1 1 1 1 1
symmnumber: 1
zpe: 606579.9 jmol-1
zpe.correction: 0.231034 hartree
zpe.thermalcorrener: 0.243751 hartree
zpe.thermalcorrenthalpy: 0.244695 hartree
zpe.thermalcorrgfe: 0.189737 hartree
zpe.sumelectzpe: -615.099386 hartree
zpe.sumelectthermal: -615.086669 hartree
zpe.sumelectthermalent: -615.085725 hartree
zpe.sumelectthermalfe: -615.140683 hartree
dipole: -0.2621 -1.2329 0.8289
dipole: 1.5086
quadrupole: -77.0918 -84.0197 -79.3571
quadrupole: -2.1440 1.9922 1.8389
quadrupole: 3.0644 -3.8635 0.7991 -2.1440 1.9922 1.8389
hfenergy: -615.3304201 hartree
pointgroup: C01 [X(C12H14O2)]
dipole: -0.1177366 -0.1116358 0.5709099 debye
polarizability: 160.2908596|1.4808938|93.5664218|-0.9839525|3.9092866|127.0976158 unknown
InChI: InChI=1S/C12H14O2/c13-11(14)12(8-4-5-9-12)10-6-2-1-3-7-10/h1-3,6-7,13H,4-5,8-9H2
charge 0 multiplicity 1
28 atoms
O  1.084845 2.259378 0.454753
O  1.464155 1.495448 -1.695368
C  0.760222 -0.133964 0.062762
C  1.420755 -0.368874 1.452282
C  1.415138 -1.255011 -0.807277
C  2.901295 -0.675065 1.114144
C  2.863317 -1.435939 -0.253261
C  -0.78228 -0.172387 0.045962
C  1.153801 1.242971 -0.509718
C  -1.4656 -0.311615 -1.191515
C  -1.54628 -0.05304 1.233553
C  -2.875814 -0.348675 -1.237703
C  -2.958516 -0.092862 1.189194
C  -3.62946 -0.242137 -0.045609
H  0.94257 -1.254192 1.914442
H  1.305485 0.48693 2.136381
H  1.409521 -0.995164 -1.878542
H  0.824926 -2.179692 -0.675237
H  3.393472 -1.259391 1.911332
H  3.465007 0.271374 1.011442
H  3.611879 -1.024609 -0.952816
H  3.096291 -2.507676 -0.122042
H  -0.891509 -0.383318 -2.12225
H  -1.042217 0.075609 2.196446
H  -3.385408 -0.458127 -2.20171
H  -3.533479 -0.002839 2.117901
H  1.279618 3.131499 0.015784
H  -4.724335 -0.270834 -0.07963
