program: Orca
programVersion: 5.0.2
elementType: O O O O O N N N N N N N N C C C C C C C C C C C C C C C C C H H H H H H H H H H H H H H H H H H H H H H H H H H
charge: 0
multiplicity: 1
keywords: wb97x-d3
keywords: def2-TZVPP
keywords: def2/J RIJCOSX
keywords: DEFGRID2
keywords: scfconv7
keywords: smallprint printgap noloewdin
keywords: NOSOSCF
formula: C17H26N8O5
InChI: InChI=1/C17H26N8O5/c1-24(16(20)21)6-4-9(18)8-12(26)22-10-2-3-13(30-14(10)15(27)28)25-7-5-11(19)23-17(25)29/h2-3,5,7,9-10,13-14,22H,4,6,8,18-21H2,1H3
56 atoms
O  1.926246 -0.581717 -0.661436
O  -2.111599 -0.677636 2.48957
O  -1.046466 0.676203 -1.982893
O  0.700814 1.722373 -1.067311
O  4.772653 -3.210959 -1.016194
N  -1.525255 -1.219584 0.384455
N  3.876833 -1.468819 0.131382
N  -5.663876 -0.147976 -0.485994
N  -3.71206 2.970738 -0.353846
N  6.196982 -1.878315 0.120235
N  -5.040292 3.297205 -2.22054
N  -2.810861 2.823816 -2.478143
N  7.599044 -0.551108 1.328602
C  -0.114729 -0.947143 0.553201
C  0.52334 -0.640783 -0.810777
C  -4.407504 0.082512 0.20533
C  2.527501 -1.800379 -0.315391
C  -3.868484 -1.179551 0.91513
C  0.594146 -2.114127 1.181471
C  -4.570044 1.235735 1.191143
C  1.783484 -2.521308 0.763916
C  -2.433478 -1.014091 1.351121
C  -4.804217 2.59394 0.542146
C  0.033457 0.714939 -1.343224
C  4.03945 -0.480036 1.046598
C  4.967677 -2.23666 -0.290781
C  -2.38766 2.973745 0.242983
C  -3.856918 3.013537 -1.68086
C  5.260645 -0.141731 1.497765
C  6.361966 -0.875932 0.964325
H  -0.00846 -0.067497 1.197281
H  0.25154 -1.436779 -1.517996
H  -3.670907 0.359013 -0.555325
H  2.631323 -2.442193 -1.194906
H  -3.945005 -2.021371 0.222431
H  -4.485362 -1.408537 1.786533
H  0.08528 -2.635507 1.983748
H  -3.706552 1.294682 1.854712
H  -5.426411 1.031159 1.841555
H  -1.850487 -1.494169 -0.530926
H  2.266754 -3.394941 1.184946
H  -4.89296 3.355912 1.318527
H  -5.744034 2.584938 -0.001302
H  -5.543243 -0.899544 -1.154324
H  -6.350047 -0.478187 0.184169
H  3.147706 0.024915 1.389498
H  -2.463541 3.416859 1.234564
H  -1.966146 1.974631 0.349239
H  -1.706356 3.586269 -0.341822
H  5.394154 0.65132 2.217877
H  -2.066374 2.160806 -2.222384
H  -5.76581 3.753954 -1.692785
H  -5.165672 3.23156 -3.21752
H  -2.94352 2.980068 -3.465604
H  8.386908 -1.065501 0.971453
H  7.768651 0.196894 1.979615
elementType: O N C H
totalener: -1477.90683567 hartree
nucrepener: 3089.67438454 hartree
electener: -4567.58122021 hartree
oneelecener: -8163.51565319 hartree
twoeener: 3595.93443298 hartree
cpcmener: -0.14725423 hartree
kineticenergy: 1471.59439444 hartree
xcener: -138.845031454290 hartree
chargesum: -0.0000000
charge: -0.381077 -0.577886 -0.622495 -0.625622 -0.583333 -0.185698 -0.078709 -0.422248 -0.113232 -0.406911 -0.237451 -0.291559 -0.221342 0.178963 0.138321 0.198925 0.248915 -0.162170 -0.231253 -0.156613 -0.213969 0.329676 -0.088351 0.325272 0.061560 0.356072 -0.194413 0.394361 -0.297998 0.292968 0.090338 0.106581 0.046107 0.122868 0.107821 0.091855 0.146260 0.087004 0.099956 0.169735 0.145689 0.115548 0.093307 0.139631 0.138546 0.164970 0.129575 0.094373 0.118725 0.161423 0.217467 0.207625 0.197794 0.184324 0.190165 0.199608
qa: -0.3811 -0.5779 -0.6225 -0.6256 -0.5833 -0.1857 -0.0787 -0.4222 -0.1132 -0.4069 -0.2375 -0.2916 -0.2213 0.1790 0.1383 0.1989 0.2489 -0.1622 -0.2313 -0.1566 -0.2140 0.3297 -0.0884 0.3253 0.0616 0.3561 -0.1944 0.3944 -0.2980 0.2930 0.0903 0.1066 0.0461 0.1229 0.1078 0.0919 0.1463 0.0870 0.1000 0.1697 0.1457 0.1155 0.0933 0.1396 0.1385 0.1650 0.1296 0.0944 0.1187 0.1614 0.2175 0.2076 0.1978 0.1843 0.1902 0.1996
va: 1.9727 1.9044 1.8484 1.8301 1.8926 3.1991 3.1392 3.0066 3.2052 2.9760 3.3141 3.2458 3.2934 3.6740 3.8992 3.7691 3.9311 3.8800 3.9597 3.8155 3.9151 4.1070 3.8745 4.3635 3.9841 4.4475 3.8880 4.1431 3.8844 4.1722 1.0442 1.0199 1.0480 1.0302 1.0208 1.0308 1.0131 1.0319 1.0187 1.0256 1.0058 1.0051 1.0420 1.0203 1.0224 1.0050 0.9978 0.9757 1.0197 0.9982 1.0812 0.9922 1.0012 1.0088 1.0107 0.9960
dispcorr: -0.033436115 hartree
energy: -1477.940271787190
dipole: -35.98316 28.82008 -7.16307 12.79358 -8.99361 3.79998 4.09977 -3.38231 0.71747
magnitude: 8.14028 au
magnitude: 20.69095 debye
