program: Orca
programVersion: 5.0.2
elementType: O O O O O N N N N N N N N C C C C C C C C C C C C C C C C C H H H H H H H H H H H H H H H H H H H H H H H H H H
charge: 0
multiplicity: 1
keywords: wb97x-d3
keywords: def2-TZVPP
keywords: def2/J RIJCOSX
keywords: DEFGRID2
keywords: scfconv7
keywords: smallprint printgap noloewdin
keywords: NOSOSCF
formula: C17H26N8O5
InChI: InChI=1/C17H26N8O5/c1-24(16(20)21)6-4-9(18)8-12(26)22-10-2-3-13(30-14(10)15(27)28)25-7-5-11(19)23-17(25)29/h2-3,5,7,9-10,13-14,22H,4,6,8,18-21H2,1H3
56 atoms
O  1.935254 -0.53785 -0.635666
O  -2.163671 -0.725144 2.435704
O  -1.015075 0.78612 -1.930825
O  0.708793 1.783149 -0.919876
O  4.737641 -3.236016 -1.027563
N  -1.52292 -1.244431 0.3403
N  3.887066 -1.465821 0.109217
N  -5.650818 -0.167205 -0.6012
N  -3.741631 2.967194 -0.280705
N  6.195098 -1.94056 0.110557
N  -5.014257 3.359482 -2.172629
N  -2.768599 2.938004 -2.378011
N  7.628812 -0.645804 1.317348
C  -0.117979 -0.965508 0.541378
C  0.533687 -0.589982 -0.799074
C  -4.420919 0.055357 0.13903
C  2.533369 -1.77146 -0.345779
C  -3.878891 -1.224347 0.814784
C  0.594643 -2.151973 1.12715
C  -4.634654 1.165658 1.163388
C  1.788914 -2.536828 0.702331
C  -2.455561 -1.053284 1.286796
C  -4.861317 2.54548 0.559274
C  0.050563 0.79154 -1.266595
C  4.072409 -0.479889 1.022744
C  4.957671 -2.26681 -0.301973
C  -2.438982 2.955958 0.361891
C  -3.843111 3.072373 -1.607728
C  5.301216 -0.17409 1.477621
C  6.384308 -0.938938 0.950606
H  -0.032444 -0.11594 1.227091
H  0.26916 -1.349366 -1.548015
H  -3.666814 0.373671 -0.587522
H  2.631055 -2.37364 -1.253805
H  -3.928262 -2.040836 0.090146
H  -4.510473 -1.494393 1.663691
H  0.083052 -2.705807 1.905758
H  -3.79757 1.207282 1.86088
H  -5.512554 0.926044 1.771846
H  -1.824563 -1.518343 -0.583311
H  2.273912 -3.423626 1.092724
H  -4.989029 3.276225 1.359786
H  -5.779693 2.545796 -0.019702
H  -5.491974 -0.880165 -1.303127
H  -6.348032 -0.548359 0.029469
H  3.194041 0.051284 1.359686
H  -2.01694 1.955185 0.45011
H  -1.740414 3.58969 -0.178192
H  -2.551665 3.365653 1.364464
H  5.453614 0.617575 2.195456
H  -2.025711 2.268863 -2.130738
H  -5.760049 3.789462 -1.650532
H  -5.097232 3.361321 -3.176422
H  -2.876089 3.133049 -3.36174
H  8.402724 -1.187135 0.969871
H  7.816328 0.095027 1.971597
elementType: O N C H
totalener: -1477.90672999 hartree
nucrepener: 3088.23464519 hartree
electener: -4566.14137518 hartree
oneelecener: -8160.68498682 hartree
twoeener: 3594.54361163 hartree
cpcmener: -0.14663160 hartree
kineticenergy: 1471.59530473 hartree
xcener: -138.845101773673 hartree
chargesum: 0.0000000
charge: -0.380725 -0.577392 -0.621296 -0.626414 -0.585014 -0.185265 -0.078749 -0.422907 -0.110984 -0.406779 -0.237811 -0.292170 -0.222069 0.184435 0.133603 0.198054 0.249949 -0.161185 -0.237191 -0.157108 -0.210897 0.329118 -0.090198 0.325957 0.063670 0.357687 -0.194744 0.394595 -0.297644 0.293565 0.090215 0.106369 0.046890 0.123614 0.106159 0.093048 0.147159 0.087075 0.099881 0.170098 0.145635 0.116193 0.093211 0.139847 0.138920 0.162559 0.094812 0.118657 0.130037 0.161375 0.216677 0.207805 0.196431 0.183538 0.190117 0.199590
qa: -0.3807 -0.5774 -0.6213 -0.6264 -0.5850 -0.1853 -0.0787 -0.4229 -0.1110 -0.4068 -0.2378 -0.2922 -0.2221 0.1844 0.1336 0.1981 0.2499 -0.1612 -0.2372 -0.1571 -0.2109 0.3291 -0.0902 0.3260 0.0637 0.3577 -0.1947 0.3946 -0.2976 0.2936 0.0902 0.1064 0.0469 0.1236 0.1062 0.0930 0.1472 0.0871 0.0999 0.1701 0.1456 0.1162 0.0932 0.1398 0.1389 0.1626 0.0948 0.1187 0.1300 0.1614 0.2167 0.2078 0.1964 0.1835 0.1901 0.1996
va: 1.9731 1.9046 1.8506 1.8295 1.8890 3.2004 3.1424 3.0050 3.2076 2.9771 3.3119 3.2438 3.2926 3.6677 3.9054 3.7669 3.9279 3.8817 3.9718 3.8159 3.9127 4.1064 3.8727 4.3604 3.9814 4.4453 3.8874 4.1427 3.8809 4.1708 1.0456 1.0206 1.0483 1.0281 1.0216 1.0301 1.0123 1.0328 1.0188 1.0240 1.0064 1.0050 1.0426 1.0201 1.0223 1.0090 0.9752 1.0201 0.9976 0.9981 1.0829 0.9918 1.0020 1.0092 1.0108 0.9961
dispcorr: -0.033401811 hartree
energy: -1477.940131799362
dipole: -36.01441 28.97512 -7.03929 12.54470 -8.79564 3.74906 3.80417 -3.24844 0.55574
magnitude: 7.99474 au
magnitude: 20.32102 debye
