program: Orca
programVersion: 5.0.2
elementType: O O O O O N N N N N N N N C C C C C C C C C C C C C C C C C H H H H H H H H H H H H H H H H H H H H H H H H H H
charge: 0
multiplicity: 1
keywords: wb97x-d3
keywords: def2-TZVPP
keywords: def2/J RIJCOSX
keywords: DEFGRID2
keywords: scfconv7
keywords: smallprint printgap noloewdin
keywords: NOSOSCF
formula: C17H26N8O5
InChI: InChI=1/C17H26N8O5/c1-24(16(20)21)6-4-9(18)8-12(26)22-10-2-3-13(30-14(10)15(27)28)25-7-5-11(19)23-17(25)29/h2-3,5,7,9-10,13-14,22H,4,6,8,18-21H2,1H3
56 atoms
O  1.851397 -0.675105 -0.533912
O  -2.047542 -0.073275 2.309158
O  -1.186071 0.798964 -1.309241
O  0.558372 1.611637 -0.178759
O  4.65499 -3.077212 -1.746807
N  -1.465415 -1.602928 0.751364
N  3.87602 -1.667463 -0.146376
N  -5.626012 -0.744122 -0.546008
N  -4.39589 3.403089 -0.827895
N  6.183256 -2.050454 -0.441406
N  -3.19236 5.328009 -0.431284
N  -2.093758 3.472253 -1.185275
N  7.697042 -1.049783 0.935545
C  -0.043947 -1.359359 0.784935
C  0.438172 -0.737007 -0.537029
C  -4.288697 -0.363461 -0.122517
C  2.489374 -1.92321 -0.528346
C  -3.80797 -1.173781 1.101123
C  0.717128 -2.62636 1.038877
C  -4.246637 1.135077 0.150988
C  1.860831 -2.890935 0.424431
C  -2.368753 -0.897483 1.456321
C  -4.475224 1.971854 -1.100008
C  -0.097046 0.692625 -0.692735
C  4.127038 -0.902359 0.946352
C  4.919906 -2.305633 -0.825299
C  -5.561761 4.017646 -0.209082
C  -3.228802 4.049599 -0.810301
C  5.385864 -0.665924 1.358205
C  6.430137 -1.268334 0.594416
H  0.148735 -0.657238 1.600005
H  0.084956 -1.360464 -1.369334
H  -3.612136 -0.583386 -0.953123
H  2.511147 -2.349629 -1.53524
H  -3.940226 -2.235801 0.878343
H  -4.435087 -0.933199 1.962158
H  0.29586 -3.331231 1.746128
H  -3.284697 1.413076 0.582906
H  -5.003375 1.382746 0.903265
H  -1.805942 -2.237873 0.04306
H  2.38913 -3.823036 0.585358
H  -5.461445 1.784034 -1.518576
H  -3.76705 1.707213 -1.885445
H  -5.640455 -1.736011 -0.752193
H  -6.262844 -0.614841 0.233213
H  3.274634 -0.485453 1.463428
H  -5.888486 4.903021 -0.755709
H  -6.381128 3.30631 -0.233702
H  -5.381159 4.286224 0.832304
H  5.588635 -0.048279 2.220173
H  -1.929139 2.457436 -1.225986
H  -4.03086 5.875679 -0.32631
H  -2.322479 5.833961 -0.475126
H  -1.251945 4.025809 -1.139664
H  8.446282 -1.459445 0.402833
H  7.929066 -0.444388 1.704621
elementType: O N C H
totalener: -1477.91007291 hartree
nucrepener: 3047.09286201 hartree
electener: -4525.00293492 hartree
oneelecener: -8079.81078685 hartree
twoeener: 3554.80785193 hartree
cpcmener: -0.15224551 hartree
kineticenergy: 1471.58859908 hartree
xcener: -138.844066669746 hartree
chargesum: -0.0000000
charge: -0.378746 -0.565423 -0.624491 -0.634017 -0.584188 -0.208058 -0.080532 -0.406388 -0.137194 -0.407477 -0.253510 -0.298753 -0.221668 0.212876 0.118399 0.167726 0.248410 -0.155810 -0.241416 -0.193222 -0.200092 0.302423 -0.062553 0.337457 0.063357 0.356438 -0.190764 0.410232 -0.296753 0.295096 0.092169 0.106287 0.074277 0.124205 0.107314 0.091965 0.141087 0.076199 0.105848 0.175915 0.146719 0.101425 0.106426 0.138672 0.139110 0.163154 0.123522 0.111619 0.133726 0.160643 0.227658 0.207290 0.198675 0.184856 0.190233 0.199646
qa: -0.3787 -0.5654 -0.6245 -0.6340 -0.5842 -0.2081 -0.0805 -0.4064 -0.1372 -0.4075 -0.2535 -0.2988 -0.2217 0.2129 0.1184 0.1677 0.2484 -0.1558 -0.2414 -0.1932 -0.2001 0.3024 -0.0626 0.3375 0.0634 0.3564 -0.1908 0.4102 -0.2968 0.2951 0.0922 0.1063 0.0743 0.1242 0.1073 0.0920 0.1411 0.0762 0.1058 0.1759 0.1467 0.1014 0.1064 0.1387 0.1391 0.1632 0.1235 0.1116 0.1337 0.1606 0.2277 0.2073 0.1987 0.1849 0.1902 0.1996
va: 1.9764 1.9230 1.8432 1.8278 1.8919 3.2131 3.1434 3.0380 3.2487 2.9750 3.3191 3.2674 3.2938 3.6217 3.9191 3.8145 3.9303 3.8590 4.0024 3.8064 3.8874 4.1680 3.7752 4.3225 3.9833 4.4474 3.8808 4.1661 3.8825 4.1702 1.0642 1.0267 1.0450 1.0301 1.0215 1.0326 1.0089 1.0522 1.0208 1.0088 1.0045 1.0403 1.0134 1.0187 1.0232 1.0067 0.9892 0.9985 0.9903 0.9986 1.0674 0.9968 1.0004 1.0151 1.0107 0.9961
dispcorr: -0.031462802 hartree
energy: -1477.941535709208
dipole: -38.02339 32.38217 -5.64123 13.75138 -9.45564 4.29574 3.37613 -1.14076 2.23537
magnitude: 7.43463 au
magnitude: 18.89732 debye
