program: Gaussian 09
title: 000066236
version: EM64L-G09RevD.01
frameworkgroup: C1[X(C13H12N2O4S)]
method: RPBEPBE
basis: SDD
operation: Freq
keyword: #p
keyword: freq=noraman
keyword: PBEPBE/SDD
title: #p freq=noraman PBEPBE/SDD
converged: YES YES NO NO
title: Mulliken charges:
elementType: S O O O O N N C C C C C C C C C C C C C H H H H H H H H H H H H
charge: 0.944992 -0.504425 -0.523009 -0.199869 -0.188251 -0.539761 0.025700 -0.221466 0.485811 -0.363119 -0.337259 0.405210 0.367764 -0.834477 -0.366842 -0.330610 -0.366549 -0.202613 -0.199238 -0.236510 0.348946 0.295486 0.254025 0.296540 0.242668 0.235432 0.293731 0.292094 0.216358 0.239422 0.232767 0.237053
chargesum: 0.00000
title: Mulliken charges with hydrogens summed into heavy atoms:
elementType: S O O O O N N C C C C C C C C C C C C C
charge: 0.944992 -0.504425 -0.523009 -0.199869 -0.188251 -0.244275 0.025700 -0.221466 0.485811 -0.014173 -0.083234 0.405210 0.367764 -0.059838 -0.073111 -0.038516 -0.150191 0.036809 0.033528 0.000543
polarizability: 1.97943965e+02 -9.89742402e+00 2.20868317e+02 2.94600103e+00 -8.10623974e+00 1.89907970e+02
1716.lowfreq: -11.6453 -1.8989 0.0019 0.0023 0.0025 5.6125 17.1768 18.4872 38.5710
frequency: 15.4737 18.3823 38.5442 53.6659 85.5231 97.3971 104.0729 110.8740 130.6063 159.5455 178.6935 213.1362 220.8393 243.7891 270.1886 274.8773 301.5147 348.4497 374.5524 399.5208 404.3113 425.0193 438.7436 458.9565 498.6731 523.2951 524.1124 561.5165 612.0037 613.9880 656.0731 686.1557 690.3680 713.2478 753.1993 755.4817 780.9187 814.6037 818.2665 831.0636 839.8140 848.8098 915.3191 948.1716 960.1901 974.3863 984.1673 993.8542 998.1061 1001.0740 1007.7283 1022.1487 1048.5814 1079.6262 1097.3456 1141.6340 1173.7840 1181.6739 1202.4725 1218.8134 1225.0923 1237.9408 1261.6753 1332.0446 1355.3704 1388.0286 1390.2227 1401.0723 1402.9906 1447.7869 1456.0521 1467.4515 1472.8876 1485.6234 1577.8370 1582.4653 1599.4805 1601.8945 2973.2099 3060.6618 3105.3195 3114.2655 3138.0217 3148.0864 3149.0315 3161.9562 3164.5613 3176.3045 3185.5219 3394.7773
redmass: 4.5936 7.6778 4.9010 10.7017 4.9493 5.4010 3.6813 1.5964 3.1544 6.0238 8.5456 6.8655 7.3425 10.8928 4.5715 5.3278 5.3660 7.4462 7.3184 5.3297 2.8456 2.5401 6.2553 3.7683 3.4977 5.3162 5.7310 5.9743 6.0790 7.1777 7.9717 5.3700 1.9934 3.5625 4.2553 1.8539 2.0610 5.1368 4.9555 7.5803 1.2930 1.3327 1.4579 6.0131 1.4288 1.3826 6.1450 1.3600 1.3464 1.8051 2.3356 2.1421 1.5713 1.5668 2.9017 1.2541 1.0574 1.1482 3.5264 5.5349 1.6584 2.1241 1.4282 1.2668 4.2738 7.1198 8.1643 1.2282 5.6394 2.2401 2.3462 1.1918 2.1195 1.0825 7.2013 5.9490 5.9281 7.4293 1.0420 1.0912 1.1000 1.0885 1.0872 1.0906 1.0925 1.0920 1.0960 1.1002 1.0953 1.0758
irintensity: 0.8215 0.5038 1.0736 0.9787 3.7666 0.3573 0.5610 2.8403 1.9727 1.4490 6.9629 1.5042 3.9926 5.5504 5.7346 0.3910 4.4261 2.1885 18.7506 15.1667 5.4924 25.5247 78.4688 77.6571 11.8368 20.5755 1.6597 3.8685 1.7118 4.3192 0.5952 1.2846 31.1650 15.4412 54.9234 70.4255 10.8387 117.7393 10.2482 43.4374 8.0765 17.7356 7.4157 55.4022 9.2694 0.2449 0.0661 4.1345 0.7604 1.7759 2.0771 3.8115 15.5232 13.8186 24.8739 17.3105 0.0620 4.3460 173.9877 133.1245 2.4863 9.1363 1.5642 2.1806 27.4447 3.6710 56.1325 26.5714 32.2730 10.9448 15.2620 7.6897 34.2615 35.3654 1.4441 3.1241 1.7385 26.4303 10.7203 18.1616 6.6524 9.0208 0.6611 5.9754 19.0904 23.8517 13.4087 10.7601 2.6546 19.1433
temp: 298.150 k
press: 1.00000 atm
elementType: 16 8 8 8 8 7 7 6 6 6 6 6 6 6 6 6 6 6 6 6 1 1 1 1 1 1 1 1 1 1 1 1
symmnumber: 1
zpe: 599897.2 jmol-1
zpe.correction: 0.228489 hartree
zpe.thermalcorrener: 0.247613 hartree
zpe.thermalcorrenthalpy: 0.248557 hartree
zpe.thermalcorrgfe: 0.178430 hartree
zpe.sumelectzpe: -1309.345193 hartree
zpe.sumelectthermal: -1309.326069 hartree
zpe.sumelectthermalent: -1309.325125 hartree
zpe.sumelectthermalfe: -1309.395252 hartree
dipole: 1.8530 0.6051 7.6584
dipole: 7.9026
quadrupole: -137.9595 -127.7027 -121.6378
quadrupole: 15.5978 0.6037 -9.7042
quadrupole: -8.8595 1.3973 7.4622 15.5978 0.6037 -9.7042
hfenergy: -1309.5736817 hartree
pointgroup: C01 [X(C13H12N2O4S1)]
dipole: 0.6905411 -0.0674536 -3.0307073 debye
polarizability: 196.3137506|7.676957|222.9667028|-2.0803302|-7.3197844|189.4397982 unknown
InChI: InChI=1S/C13H12N2O4S/c1-10-7-8-12(15(16)17)9-13(10)20(18,19)14-11-5-3-2-4-6-11/h2-9,14H,1H3
charge 0 multiplicity 1
32 atoms
S  0.824701 1.843669 1.227952
O  0.662731 1.098164 2.655795
O  0.92687 3.463005 1.12092
O  -4.326323 -1.824402 -0.045116
O  -3.011021 -1.800764 1.820481
N  2.482911 1.20671 0.46052
N  -3.3269 -1.383669 0.642923
C  -0.62185 1.178819 0.141653
C  -0.86448 1.690449 -1.157713
C  -1.393835 0.188015 0.761182
C  -1.987372 1.142318 -1.838606
C  -2.482985 -0.324631 0.029951
C  2.50648 -0.147933 0.026547
C  0.001129 2.738015 -1.825968
C  -2.794796 0.143016 -1.26389
C  2.389425 -1.18107 0.999188
C  2.693512 -0.483947 -1.344628
C  2.45677 -2.528808 0.594007
C  2.799817 -1.836405 -1.730615
C  2.669373 -2.863484 -0.766164
H  -1.168001 -0.163544 1.773187
H  2.712218 1.912783 -0.261754
H  -2.221966 1.514624 -2.841557
H  0.307905 3.523819 -1.114842
H  -0.533077 3.204982 -2.668913
H  0.921294 2.276418 -2.237018
H  -3.654886 -0.27655 -1.792175
H  2.261762 -0.909322 2.051568
H  2.779224 0.311995 -2.096215
H  2.361833 -3.321423 1.343784
H  2.970139 -2.08915 -2.782791
H  2.7370 -3.913398 -1.069893
