program: Orca
programVersion: 5.0.2
elementType: O O O O O N N N N N N N N C C C C C C C C C C C C C C C C C H H H H H H H H H H H H H H H H H H H H H H H H H H
charge: 0
multiplicity: 1
keywords: wb97x-d3
keywords: def2-TZVPP
keywords: def2/J RIJCOSX
keywords: DEFGRID2
keywords: scfconv7
keywords: smallprint printgap noloewdin
keywords: NOSOSCF
formula: C17H26N8O5
InChI: InChI=1/C17H26N8O5/c1-24(16(20)21)6-4-9(18)8-12(26)22-10-2-3-13(30-14(10)15(27)28)25-7-5-11(19)23-17(25)29/h2-3,5,7,9-10,13-14,22H,4,6,8,18-21H2,1H3
56 atoms
O  1.9011 -0.543196 -0.639274
O  -2.162788 -0.717276 2.483173
O  -1.047821 0.814315 -1.882472
O  0.674064 1.786571 -0.840441
O  4.705563 -3.266075 -0.967969
N  -1.543895 -1.243916 0.38165
N  3.858485 -1.45527 0.102074
N  -5.664387 -0.237815 -0.565357
N  -3.692971 2.880637 -0.315222
N  6.165706 -1.933036 0.125596
N  -4.893206 3.458603 -2.205439
N  -2.648626 2.973728 -2.366971
N  7.606325 -0.607176 1.282837
C  -0.13353 -0.984666 0.562621
C  0.498821 -0.58607 -0.780478
C  -4.438332 0.000927 0.174386
C  2.50907 -1.770264 -0.365345
C  -3.892895 -1.253681 0.892314
C  0.578632 -2.190226 1.109673
C  -4.663086 1.151171 1.154068
C  1.770595 -2.563649 0.667594
C  -2.463664 -1.061378 1.345746
C  -4.862789 2.497617 0.469547
C  0.016678 0.809609 -1.211427
C  4.04715 -0.427296 0.96334
C  4.929542 -2.274824 -0.282561
C  -2.429285 2.904796 0.400459
C  -3.743348 3.10004 -1.630591
C  5.276675 -0.106744 1.410869
C  6.357534 -0.902372 0.923947
H  -0.028874 -0.150854 1.264802
H  0.218327 -1.32921 -1.540857
H  -3.681621 0.300573 -0.557572
H  2.622871 -2.361375 -1.279953
H  -3.947876 -2.097894 0.199924
H  -4.515078 -1.494387 1.757101
H  0.070932 -2.764352 1.876551
H  -3.844329 1.213157 1.872067
H  -5.559767 0.947147 1.748229
H  -1.85069 -1.563605 -0.525406
H  2.256793 -3.461426 1.031162
H  -5.061168 3.269935 1.216969
H  -5.733212 2.436321 -0.178825
H  -5.507872 -0.940061 -1.278125
H  -6.370487 -0.616356 0.056497
H  3.171467 0.128488 1.265581
H  -2.016522 1.909923 0.561896
H  -1.696647 3.503722 -0.133451
H  -2.59474 3.367904 1.373581
H  5.42769 0.719594 2.089139
H  -1.936144 2.250163 -2.133888
H  -5.624925 3.910416 -1.680912
H  -4.948217 3.533337 -3.209028
H  -2.690926 3.267544 -3.330692
H  8.372617 -1.169559 0.95125
H  7.808708 0.160577 1.89989
elementType: O N C H
totalener: -1477.89784343 hartree
nucrepener: 3092.59209211 hartree
electener: -4570.48993554 hartree
oneelecener: -8169.28780526 hartree
twoeener: 3598.79786971 hartree
cpcmener: -0.11598748 hartree
kineticenergy: 1471.60038572 hartree
xcener: -138.841786549537 hartree
chargesum: -0.0000000
charge: -0.363036 -0.535615 -0.599721 -0.581784 -0.543205 -0.180973 -0.078596 -0.417276 -0.104484 -0.398679 -0.249080 -0.298578 -0.229616 0.177861 0.144544 0.187597 0.245222 -0.159365 -0.241859 -0.152149 -0.209394 0.300049 -0.104055 0.291776 0.065139 0.338186 -0.191651 0.404619 -0.301359 0.295588 0.088859 0.099693 0.046471 0.121799 0.102212 0.090300 0.144755 0.088441 0.096748 0.163643 0.142935 0.117005 0.092503 0.137509 0.136657 0.155168 0.096627 0.113448 0.129764 0.155267 0.219575 0.204138 0.190471 0.175983 0.186682 0.193243
qa: -0.3630 -0.5356 -0.5997 -0.5818 -0.5432 -0.1810 -0.0786 -0.4173 -0.1045 -0.3987 -0.2491 -0.2986 -0.2296 0.1779 0.1445 0.1876 0.2452 -0.1594 -0.2419 -0.1521 -0.2094 0.3000 -0.1041 0.2918 0.0651 0.3382 -0.1917 0.4046 -0.3014 0.2956 0.0889 0.0997 0.0465 0.1218 0.1022 0.0903 0.1448 0.0884 0.0967 0.1636 0.1429 0.1170 0.0925 0.1375 0.1367 0.1552 0.0966 0.1134 0.1298 0.1553 0.2196 0.2041 0.1905 0.1760 0.1867 0.1932
va: 1.9902 1.9585 1.8737 1.8917 1.9424 3.1808 3.1454 3.0119 3.2018 2.9830 3.3040 3.2277 3.2761 3.6783 3.9006 3.7631 3.9395 3.8696 3.9783 3.8277 3.9090 4.1465 3.8586 4.4015 3.9921 4.4714 3.8882 4.1225 3.8750 4.1635 1.0467 1.0222 1.0551 1.0267 1.0224 1.0308 1.0123 1.0332 1.0200 1.0262 1.0087 1.0025 1.0504 1.0216 1.0240 1.0158 0.9750 1.0279 0.9967 1.0002 1.0941 0.9938 1.0061 1.0140 1.0136 1.0003
dispcorr: -0.033473706 hartree
energy: -1477.931317140250
dipole: -35.74343 29.15441 -6.58902 12.62075 -8.79662 3.82413 3.43361 -3.24266 0.19095
magnitude: 7.62074 au
magnitude: 19.37038 debye
