program: Orca
programVersion: 5.0.2
elementType: O O O O O N N N N N N N N C C C C C C C C C C C C C C C C C H H H H H H H H H H H H H H H H H H H H H H H H H H
charge: 0
multiplicity: 1
keywords: wb97x-d3
keywords: def2-TZVPP
keywords: def2/J RIJCOSX
keywords: DEFGRID2
keywords: scfconv7
keywords: smallprint printgap noloewdin
keywords: NOSOSCF
formula: C17H26N8O5
InChI: InChI=1/C17H26N8O5/c1-24(16(20)21)6-4-9(18)8-12(26)22-10-2-3-13(30-14(10)15(27)28)25-7-5-11(19)23-17(25)29/h2-3,5,7,9-10,13-14,22H,4,6,8,18-21H2,1H3
56 atoms
O  1.854552 -0.639372 -0.436278
O  -2.203322 -0.362648 2.522629
O  -1.17997 0.880544 -1.238275
O  0.66429 1.702536 -0.285465
O  4.570441 -3.096981 -1.671057
N  -1.520379 -1.513686 0.701161
N  3.850616 -1.678233 -0.051905
N  -5.62905 -0.880492 -0.555644
N  -4.338287 3.344111 -0.796949
N  6.145801 -2.043567 -0.44357
N  -3.219996 5.350422 -0.661663
N  -2.063124 3.464921 -1.264278
N  7.714379 -1.012813 0.840942
C  -0.107543 -1.247918 0.819946
C  0.444264 -0.659038 -0.491383
C  -4.305579 -0.43962 -0.141021
C  2.452464 -1.902523 -0.404058
C  -3.884864 -1.28254 1.071663
C  0.645223 -2.503459 1.159115
C  -4.201545 1.059659 0.160118
C  1.798652 -2.816289 0.585938
C  -2.465582 -1.008385 1.515852
C  -4.414574 1.916783 -1.080185
C  -0.049278 0.781671 -0.693929
C  4.142848 -0.887957 1.009169
C  4.869476 -2.315609 -0.775542
C  -5.525893 3.978975 -0.251648
C  -3.204563 4.035117 -0.914394
C  5.416915 -0.638772 1.36688
C  6.431638 -1.246845 0.566157
H  0.021232 -0.519376 1.625615
H  0.105664 -1.285702 -1.329222
H  -3.624538 -0.671002 -0.966114
H  2.448914 -2.363457 -1.397084
H  -3.995999 -2.337592 0.809387
H  -4.553574 -1.079317 1.911092
H  0.194467 -3.166055 1.889687
H  -3.222214 1.299178 0.578357
H  -4.940017 1.322437 0.925541
H  -1.82225 -2.038325 -0.106867
H  2.306474 -3.74887 0.802865
H  -5.398525 1.736771 -1.514898
H  -3.694473 1.657707 -1.85637
H  -6.320523 -0.56081 0.114093
H  -5.879189 -0.462258 -1.442656
H  3.308834 -0.461662 1.54885
H  -5.33338 4.4405 0.71759
H  -5.937239 4.729743 -0.930322
H  -6.290067 3.220862 -0.107167
H  5.649405 -0.002004 2.207398
H  -1.844894 2.446645 -1.232014
H  -4.076705 5.878069 -0.676271
H  -2.376345 5.883812 -0.798878
H  -1.251934 4.057034 -1.354877
H  8.435736 -1.432369 0.278305
H  7.98746 -0.402473 1.591852
elementType: O N C H
totalener: -1477.90120927 hartree
nucrepener: 3043.72865968 hartree
electener: -4521.62986896 hartree
oneelecener: -8072.10120784 hartree
twoeener: 3550.47133888 hartree
cpcmener: -0.12307854 hartree
kineticenergy: 1471.59270144 hartree
xcener: -138.840434001556 hartree
chargesum: 0.0000000
charge: -0.358452 -0.530196 -0.601032 -0.591382 -0.540443 -0.192669 -0.081316 -0.401863 -0.122147 -0.398642 -0.264723 -0.300485 -0.228699 0.208990 0.110808 0.143118 0.250358 -0.141051 -0.239665 -0.176044 -0.202243 0.291959 -0.107292 0.302129 0.064314 0.335314 -0.189478 0.410142 -0.300280 0.294703 0.090865 0.097450 0.076318 0.120624 0.100362 0.090475 0.139190 0.075274 0.097208 0.164817 0.142978 0.112641 0.109960 0.135190 0.142079 0.159389 0.130811 0.123479 0.107985 0.154954 0.231926 0.202079 0.191472 0.178561 0.186731 0.193451
qa: -0.3585 -0.5302 -0.6010 -0.5914 -0.5404 -0.1927 -0.0813 -0.4019 -0.1221 -0.3986 -0.2647 -0.3005 -0.2287 0.2090 0.1108 0.1431 0.2504 -0.1411 -0.2397 -0.1760 -0.2022 0.2920 -0.1073 0.3021 0.0643 0.3353 -0.1895 0.4101 -0.3003 0.2947 0.0909 0.0974 0.0763 0.1206 0.1004 0.0905 0.1392 0.0753 0.0972 0.1648 0.1430 0.1126 0.1100 0.1352 0.1421 0.1594 0.1308 0.1235 0.1080 0.1550 0.2319 0.2021 0.1915 0.1786 0.1867 0.1935
va: 1.9876 1.9679 1.8712 1.8852 1.9501 3.1883 3.1418 3.0592 3.2347 2.9796 3.2971 3.2587 3.2775 3.6230 3.9380 3.8585 3.9290 3.8065 3.9904 3.7390 3.8811 4.1861 3.8207 4.3726 3.9937 4.4745 3.8800 4.1578 3.8790 4.1654 1.0609 1.0272 1.0406 1.0316 1.0341 1.0312 1.0104 1.0532 1.0250 1.0163 1.0062 1.0179 1.0167 1.0234 1.0246 1.0078 0.9922 0.9877 1.0002 1.0004 1.0786 0.9987 1.0053 1.0187 1.0136 1.0002
dispcorr: -0.031373133 hartree
energy: -1477.932582405766
dipole: -38.05850 32.53488 -5.52361 15.13121 -9.59145 5.53976 1.50610 -0.62667 0.87943
magnitude: 7.87227 au
magnitude: 20.00971 debye
