program: Orca
programVersion: 5.0.2
elementType: O O O O O N N N N N N N N C C C C C C C C C C C C C C C C C H H H H H H H H H H H H H H H H H H H H H H H H H H
charge: 0
multiplicity: 1
keywords: wb97x-d3
keywords: def2-TZVPP
keywords: def2/J RIJCOSX
keywords: DEFGRID2
keywords: scfconv7
keywords: smallprint printgap noloewdin
keywords: NOSOSCF
formula: C17H26N8O5
InChI: InChI=1/C17H26N8O5/c1-24(16(20)21)6-4-9(18)8-12(26)22-10-2-3-13(30-14(10)15(27)28)25-7-5-11(19)23-17(25)29/h2-3,5,7,9-10,13-14,22H,4,6,8,18-21H2,1H3
56 atoms
O  1.848514 -0.648291 -0.466891
O  -2.16192 -0.347009 2.503805
O  -1.174884 0.860885 -1.277936
O  0.604335 1.671028 -0.199825
O  4.607723 -2.803201 -1.935282
N  -1.504891 -1.555983 0.709411
N  3.854704 -1.679877 -0.108311
N  -5.643543 -0.71617 -0.570133
N  -4.325835 3.367407 -0.75258
N  6.156662 -1.913247 -0.556876
N  -3.168965 5.345538 -0.536114
N  -2.044087 3.461799 -1.193778
N  7.704956 -1.025775 0.852107
C  -0.089341 -1.295427 0.806308
C  0.437181 -0.682581 -0.50383
C  -4.296265 -0.410431 -0.119438
C  2.459358 -1.907668 -0.460426
C  -3.863939 -1.274016 1.084569
C  0.669482 -2.556025 1.10694
C  -4.190851 1.079641 0.190701
C  1.818671 -2.847087 0.514147
C  -2.438983 -1.016227 1.516256
C  -4.413246 1.941721 -1.044575
C  -0.073685 0.756133 -0.678098
C  4.133193 -1.003004 1.032637
C  4.886512 -2.165387 -0.927251
C  -5.507247 4.009366 -0.202156
C  -3.178311 4.04073 -0.833532
C  5.400941 -0.751412 1.408604
C  6.426933 -1.241653 0.5436
H  0.056175 -0.581178 1.621551
H  0.093455 -1.300901 -1.345576
H  -3.622045 -0.63266 -0.952458
H  2.456837 -2.351149 -1.461161
H  -3.984049 -2.3267 0.811933
H  -4.524814 -1.074501 1.930802
H  0.229889 -3.239937 1.824547
H  -3.209094 1.308981 0.607262
H  -4.922997 1.341166 0.963068
H  -1.818677 -2.09358 -0.085701
H  2.33423 -3.781612 0.70261
H  -5.400668 1.758973 -1.46519
H  -3.702772 1.683512 -1.830136
H  -5.704398 -1.69003 -0.84197
H  -6.292719 -0.597277 0.200126
H  3.290528 -0.672013 1.624035
H  -5.878754 4.806134 -0.85029
H  -6.297359 3.269144 -0.117725
H  -5.327042 4.414902 0.794393
H  5.62067 -0.206782 2.314736
H  -1.849099 2.440377 -1.207229
H  -4.016295 5.886807 -0.504175
H  -2.314465 5.868493 -0.640633
H  -1.217614 4.037548 -1.240958
H  8.434163 -1.357881 0.242826
H  7.96693 -0.501754 1.669299
elementType: O N C H
totalener: -1477.90258664 hartree
nucrepener: 3045.76046549 hartree
electener: -4523.66305212 hartree
oneelecener: -8076.58239290 hartree
twoeener: 3552.91934078 hartree
cpcmener: -0.12146491 hartree
kineticenergy: 1471.59607217 hartree
xcener: -138.840986402699 hartree
chargesum: 0.0000000
charge: -0.357183 -0.529586 -0.602753 -0.593196 -0.536963 -0.200295 -0.081992 -0.399172 -0.125867 -0.398293 -0.263308 -0.299641 -0.227785 0.211336 0.112559 0.158630 0.251889 -0.165802 -0.237642 -0.177828 -0.204969 0.289366 -0.080129 0.304878 0.061179 0.331928 -0.191768 0.410296 -0.300432 0.294875 0.089776 0.096705 0.072375 0.118817 0.107213 0.087045 0.137912 0.082476 0.101459 0.165389 0.142073 0.104927 0.105891 0.135175 0.135356 0.161671 0.122872 0.109274 0.131132 0.155478 0.231889 0.201903 0.192398 0.178505 0.186886 0.193070
qa: -0.3572 -0.5296 -0.6028 -0.5932 -0.5370 -0.2003 -0.0820 -0.3992 -0.1259 -0.3983 -0.2633 -0.2996 -0.2278 0.2113 0.1126 0.1586 0.2519 -0.1658 -0.2376 -0.1778 -0.2050 0.2894 -0.0801 0.3049 0.0612 0.3319 -0.1918 0.4103 -0.3004 0.2949 0.0898 0.0967 0.0724 0.1188 0.1072 0.0870 0.1379 0.0825 0.1015 0.1654 0.1421 0.1049 0.1059 0.1352 0.1354 0.1617 0.1229 0.1093 0.1311 0.1555 0.2319 0.2019 0.1924 0.1785 0.1869 0.1931
va: 1.9918 1.9707 1.8699 1.8846 1.9578 3.1921 3.1397 3.0376 3.2377 2.9779 3.3001 3.2618 3.2787 3.6207 3.9385 3.8230 3.9300 3.8522 3.9831 3.7986 3.8674 4.1909 3.7599 4.3676 3.9983 4.4789 3.8818 4.1607 3.8857 4.1665 1.0640 1.0277 1.0427 1.0357 1.0191 1.0346 1.0105 1.0523 1.0226 1.0158 1.0060 1.0426 1.0170 1.0214 1.0254 1.0028 0.9880 0.9997 0.9910 1.0003 1.0775 0.9996 1.0046 1.0193 1.0135 1.0004
dispcorr: -0.031329320 hartree
energy: -1477.933915958744
dipole: -37.79992 32.44737 -5.35255 13.27649 -9.29475 3.98174 3.03562 -1.18861 1.84701
magnitude: 6.92210 au
magnitude: 17.59459 debye
